program: Gaussian 09
title: 000176470
version: EM64L-G09RevD.01
frameworkgroup: C1[X(C16H8Br2)]
method: RPBEPBE
basis: SDD
operation: Freq
keyword: #pfreq=noraman
keyword: PBEPBE/SDD
title: #p freq=noraman PBEPBE/SDD
converged: NO YES YES YES
title: Mulliken charges:
elementType: Br Br C C C C C C C C C C C C C C C C H H H H H H H H
charge: 0.016096 0.016096 0.023140 0.023141 0.608772 0.608775 0.496443 0.496445 -0.471345 -0.471345 -0.500829 -0.500828 -0.482426 -0.482428 -0.477587 -0.477587 -0.210774 -0.210774 0.252477 0.252476 0.244310 0.244310 0.251079 0.251079 0.250641 0.250641
chargesum: 0.00000
title: Mulliken charges with hydrogens summed into heavy atoms:
elementType: Br Br C C C C C C C C C C C C C C C C
charge: 0.016096 0.016096 0.023140 0.023141 0.608772 0.608775 0.496443 0.496445 -0.218868 -0.218868 -0.256519 -0.256519 -0.482426 -0.482428 -0.226508 -0.226508 0.039867 0.039867
polarizability: 3.84337286e+02 -1.60697125e+01 2.33314185e+02 3.67444035e-02 1.87924673e-03 7.04861356e+01
1716.lowfreq: -6.3386 -0.0007 0.0003 0.0006 3.1048 3.7211 36.7080 94.6671 105.5940
frequency: 36.7080 94.6654 105.5940 121.8165 147.1180 200.2540 245.9721 247.3901 263.2720 266.2146 308.1801 406.9910 426.2978 430.8660 483.0891 506.2103 507.1793 509.2264 542.5894 549.5065 604.8373 606.1899 609.9336 685.7674 692.5685 732.8658 747.3316 804.2703 805.1465 813.2327 824.4876 843.9866 865.0590 877.8410 959.8074 960.3550 966.7887 993.7880 994.2580 1004.6095 1107.2576 1131.8719 1143.5643 1159.8846 1181.4073 1199.5493 1209.7392 1249.4788 1255.5968 1319.9830 1357.1702 1372.5437 1375.9269 1406.4068 1424.9557 1425.2107 1456.9267 1483.9610 1485.1536 1539.4273 1586.2429 1587.6994 1605.4569 1631.6056 3132.9649 3133.0511 3139.8023 3140.0893 3165.5208 3165.6562 3172.4084 3172.6327
redmass: 15.1222 6.4523 4.5351 15.7098 22.8930 4.5361 4.9118 9.3913 4.5490 14.5922 4.7149 8.1028 5.1528 3.6783 6.5867 4.6226 5.7268 3.7316 5.2478 3.0342 8.1147 7.0130 4.9859 7.0583 3.4407 2.6740 5.5008 4.8713 1.4019 1.4813 7.5022 4.4099 1.5701 1.7084 1.3868 1.3650 4.5518 1.3714 1.3687 9.1986 2.1655 3.0724 1.5972 1.4877 1.3725 1.4926 1.5950 1.7788 2.0586 2.7618 4.1212 3.9347 1.9731 9.3222 4.7087 2.1716 4.1681 3.5860 6.6732 6.0924 7.9902 6.6134 6.7596 7.4625 1.0885 1.0885 1.0894 1.0894 1.0960 1.0959 1.0957 1.0956
irintensity: 0.1332 0.0000 0.5277 0.1607 0.0000 9.2026 3.0893 0.0000 0.0000 8.8082 0.0000 0.0000 7.1713 1.1084 0.0000 12.2962 6.3491 0.0001 0.0000 0.0000 38.6735 0.0000 0.0000 1.5318 9.0524 11.4143 0.0001 37.1611 0.0007 9.3014 0.0001 0.0000 0.0001 155.2198 3.5431 0.0000 21.6051 0.0000 0.7730 164.6990 0.0000 0.0001 16.7254 0.0000 14.7845 0.0000 18.3040 9.3701 0.0000 0.0000 13.4646 13.1872 0.0000 0.0001 0.0025 62.0644 42.2646 0.0006 43.4437 0.0000 0.0000 10.4381 26.3918 0.0000 10.4102 0.0015 13.7831 0.0021 20.8152 0.0486 16.5524 0.0056
temp: 298.150 k
press: 1.00000 atm
elementType: 35 35 6 6 6 6 6 6 6 6 6 6 6 6 6 6 6 6 1 1 1 1 1 1 1 1
symmnumber: 1
zpe: 482761.4 jmol-1
zpe.correction: 0.183874 hartree
zpe.thermalcorrener: 0.197290 hartree
zpe.thermalcorrenthalpy: 0.198234 hartree
zpe.thermalcorrgfe: 0.142089 hartree
zpe.sumelectzpe: -640.282627 hartree
zpe.sumelectthermal: -640.269212 hartree
zpe.sumelectthermalent: -640.268268 hartree
zpe.sumelectthermalfe: -640.324412 hartree
dipole: 0.0000 0.0000 0.0000
dipole: 0.0000
quadrupole: -126.9419 -100.9225 -128.4971
quadrupole: -3.9255 -0.0002 0.0008
quadrupole: -8.1547 17.8647 -9.7100 -3.9255 -0.0002 0.0008
hfenergy: -640.4665016 hartree
pointgroup: C01 [X(C16H8Br2)]
dipole: -0.000001 0.0000009 -0.000003 debye
dipolederiv: -0.6833426 0.2558232 -0.0000242 0.4592453 -0.2194881 -0.0000047 0.0002965 -0.0001069 -0.0302961 -0.6824995 0.255626 0.0000167 0.4587608 -0.219376 -0.0000302 0.0003388 -0.0001115 -0.0302889 0.022793 0.0424234 0.0000644 -0.0554326 -0.0379391 0.0000172 0.0005077 -0.0001352 -0.0317686 0.0210339 0.0429247 0.0000776 -0.0576143 -0.0373405 -0.0000124 -0.0008206 0.0002246 -0.0317868 -0.4366372 0.2108043 0.0001486 0.3463735 -0.0227548 -0.0000362 -0.0008644 0.0002071 0.109637 -0.4373426 0.2108773 0.0000173 0.3461606 -0.0227642 -0.0001084 -0.0004484 0.000119 0.1096664 0.0609244 -0.0727262 -0.0000743 -0.0519098 -0.1367354 -0.0000415 0.0001255 -0.0000638 0.0878859 0.0617535 -0.0729437 -0.0000673 -0.0510942 -0.1370062 -0.0000629 0.0007322 -0.0002023 0.0879178 -0.0509879 -0.1087024 0.0000952 0.0460632 0.0235398 0.0000398 -0.0002499 0.0000619 -0.1591595 -0.0492303 -0.1091407 0.0001489 0.0474361 0.0231273 0.0000223 0.0001461 -0.0000264 -0.1591374 0.0615353 0.0226707 0.0000813 -0.1035712 0.1726229 0.0000282 -0.0001158 0.0000409 -0.1697834 0.0607898 0.0227741 -0.0000236 -0.1029138 0.1724033 0.0000008 -0.000252 0.0000587 -0.1698044 1.1038745 -0.5317258 -0.0001441 -0.8500082 0.3285922 0.000108 -0.0001847 0.000109 -0.1704383 1.1025304 -0.531359 -0.0001528 -0.8492613 0.3284108 0.0001308 0.000283 -0.0000336 -0.1704484 -0.0120315 -0.0333561 0.0000122 -0.0067291 0.0832086 0.0001055 -0.0000349 0.0000063 -0.1870741 -0.0116076 -0.0334684 0.0000273 -0.0086975 0.083578 -0.0000801 -0.0004594 0.0001113 -0.1870846 -0.1548697 0.2125093 0.0000245 0.2562448 -0.1330164 -0.0001636 0.0003006 -0.0000612 -0.0790215 -0.1558935 0.2128193 0.0000449 0.2553653 -0.1326776 -0.0000691 0.000108 -0.0000308 -0.0790445 0.0276445 0.1034452 -0.0000604 0.0365038 0.0383678 0.0000652 0.0002269 -0.0000576 0.156679 0.0270162 0.103533 -0.0001476 0.0366719 0.0383669 0.0001089 0.0000797 -0.0000302 0.1566666 0.0599451 -0.0658025 -0.0000176 0.0030643 -0.0935369 -0.0000127 -0.0001082 0.0000212 0.1530284 0.0599728 -0.0658184 -0.0000262 0.0029849 -0.0934927 -0.0000033 0.0003379 -0.0000855 0.1530487 0.0600593 0.0240086 -0.0000119 -0.0276422 -0.0926133 -0.0000698 -0.0000083 -0.0000008 0.1612956 0.0603148 0.0239731 0.0000221 -0.0262 -0.0928901 0.0000616 -0.0000287 0.0000117 0.161299 -0.058241 -0.0594593 0.0000052 -0.0519507 0.0897234 0.0000058 0.0000327 -0.0000098 0.1590053 -0.0575043 -0.0597096 -0.000036 -0.0518497 0.0896903 0.0000007 0.0000598 -0.0000161 0.1590069 unknown
polarizability: 384.8658975|-13.3462992|232.7855735|-0.0357131|0.0088462|70.4861356 unknown
InChI: InChI=1S/C16H8Br2/c17-13-8-4-10-2-6-12-14(18)7-3-9-1-5-11(13)16(10)15(9)12/h1-8H
charge 0 multiplicity 1
26 atoms
Br 4.705707 -1.221426 -0.000134
Br -4.705699 1.221435 0.000125
C  0.67134 0.261142 -0.000015
C  -0.671333 -0.261135 0.000011
C  1.801397 -0.648772 -0.000071
C  -1.801389 0.64878 0.000066
C  0.887355 1.68732 0.000021
C  -0.887347 -1.687313 -0.000027
C  1.547458 -2.072226 -0.000098
C  -1.54745 2.072233 0.000095
C  -0.257636 2.567255 0.000078
C  0.257644 -2.567247 -0.000086
C  3.105602 -0.075438 -0.000091
C  -3.105594 0.075447 0.000087
C  2.214263 2.190384 0.000006
C  -2.214255 -2.190376 -0.000018
C  3.318351 1.317058 -0.000045
C  -3.318343 -1.317051 0.000037
H  2.401911 -2.754991 -0.000147
H  -2.401903 2.7550 0.000143
H  -0.083561 3.649347 0.000118
H  0.083567 -3.649339 -0.000134
H  2.381047 3.273093 0.000042
H  -2.381038 -3.273085 -0.000053
H  4.337453 1.713228 -0.000045
H  -4.337445 -1.713221 0.000036
