program: Gaussian 09
title: 000176471
version: EM64L-G09RevD.01
frameworkgroup: C1[X(C17H18O5)]
method: RPBEPBE
basis: SDD
operation: Freq
keyword: #pfreq=noraman
keyword: PBEPBE/SDD
title: #p freq=noraman PBEPBE/SDD
converged: YES YES NO NO
title: Mulliken charges:
elementType: O O O O O C C C C C C C C C C C C C C C C C H H H H H H H H H H H H H H H H H H
charge: -0.253341 -0.289683 -0.307241 -0.437223 -0.443274 -0.269785 -0.575109 -0.354311 0.470373 0.374027 0.190243 -0.025903 -0.409158 -0.385496 -0.522827 0.098964 -0.416063 -0.429449 0.326099 0.199166 -0.522173 -0.519228 0.292136 0.220135 0.237036 0.204416 0.244210 0.233892 0.229338 0.272236 0.218322 0.217156 0.211659 0.269898 0.229702 0.360963 0.350833 0.262323 0.218624 0.228513
chargesum: 0.00000
title: Mulliken charges with hydrogens summed into heavy atoms:
elementType: O O O O O C C C C C C C C C C C C C C C C C
charge: -0.253341 -0.289683 -0.307241 -0.086390 -0.082311 0.022351 -0.117938 0.094315 0.470373 0.374027 0.190243 -0.025903 -0.175266 -0.156158 -0.250591 0.098964 -0.197741 -0.212293 0.326099 0.199166 0.189086 0.190232
polarizability: 3.07742324e+02 -1.11449476e+01 1.72622958e+02 1.03707229e+01 7.64486654e+00 1.46572003e+02
1716.lowfreq: -11.1446 -1.2868 0.0005 0.0007 0.0008 3.2866 10.3395 30.2560 39.2597
frequency: 8.7206 30.2238 39.2556 73.3761 82.3912 89.6342 113.6532 117.9825 143.6885 157.3584 164.6013 179.3367 206.8308 218.3214 249.5383 267.1923 281.2455 293.4145 325.8754 327.5876 340.7363 342.0362 380.4670 387.0771 422.3397 440.6689 452.8442 465.6182 479.3410 494.1792 528.7163 565.7391 599.6277 610.0411 618.9788 641.7495 646.0145 700.5209 714.3876 742.0916 771.1486 772.6275 781.0708 804.4612 860.7694 866.6439 885.2204 902.4509 904.2879 911.5780 920.1903 924.1449 991.1450 994.2156 1015.1599 1061.5018 1095.6772 1107.9667 1110.5009 1111.0043 1139.9809 1144.4102 1152.1663 1161.1698 1175.0001 1176.3723 1182.6066 1202.1759 1205.3829 1235.4408 1246.4079 1255.5413 1264.5375 1280.8194 1288.4598 1308.8890 1349.3864 1365.2388 1374.1991 1394.4868 1408.2459 1431.6585 1437.9491 1441.6375 1455.8409 1456.5492 1458.5978 1467.4693 1481.2243 1485.1549 1487.3335 1497.9768 1584.4016 1590.0767 1606.2949 1636.9339 2962.7148 2970.6706 2975.4612 2981.1880 3025.6437 3044.9879 3085.1623 3087.9230 3095.8275 3112.8433 3113.0468 3126.7066 3129.1614 3136.5892 3143.2133 3183.3216 3583.8212 3585.8103
redmass: 4.3194 5.5987 4.2586 2.8227 2.6632 3.4335 2.7603 2.8599 1.4506 2.1668 2.6092 2.7577 4.0820 4.2176 4.3915 4.4311 4.9357 4.7350 2.9093 1.2924 1.1299 4.4834 4.8633 5.0455 4.1492 2.9599 3.2562 5.2256 6.5463 5.9106 5.6865 4.6434 3.9185 4.1539 4.8918 4.6960 6.4900 3.2155 6.7407 5.4960 5.7381 1.5236 1.5205 4.1233 1.6311 2.1328 3.1530 2.3674 4.3488 1.7087 3.3618 1.3987 4.9292 4.4018 3.5667 2.2669 2.7252 1.3185 1.3852 1.7893 1.3833 1.5159 1.3482 1.4259 1.5346 1.6129 1.5036 1.8487 2.0801 1.4362 1.3528 1.7563 3.2104 3.9295 1.5035 1.5533 1.3635 1.4883 4.3368 6.0992 1.6233 1.1706 2.1831 1.7723 1.1418 1.1016 1.2314 1.1576 1.0778 1.6308 1.4520 3.1435 7.2813 7.3240 6.9188 6.9071 1.0641 1.0672 1.0340 1.0319 1.0911 1.0880 1.0981 1.1013 1.0984 1.0879 1.0867 1.1043 1.1051 1.0970 1.0953 1.0925 1.0661 1.0660
irintensity: 0.5311 0.1485 1.1266 5.4579 4.8683 6.0638 1.3018 0.8502 3.0477 0.4093 3.7509 0.6098 2.4931 10.0369 12.7937 2.8022 9.7717 7.5736 13.1171 111.2942 136.7235 6.0679 5.9924 5.2696 9.2976 5.9174 4.2391 1.8181 0.9333 4.9885 1.9339 1.9716 5.9252 13.6666 13.5147 10.8762 4.7510 1.0293 3.6880 3.3208 18.4365 33.3991 43.0450 17.0470 35.0199 2.5417 7.3151 55.8963 25.1633 5.6365 16.8447 8.7058 220.5002 61.9881 133.3666 10.9967 291.5532 10.9085 7.3183 49.6316 57.9219 12.0958 12.8098 11.0049 6.5207 23.8944 27.7844 12.4730 145.7171 0.2581 59.5393 15.4586 29.8287 80.5080 85.5066 7.4366 10.5255 10.8993 26.6505 52.5367 41.0747 5.7011 80.8735 61.0312 21.5454 19.1759 26.5810 20.3890 33.5612 37.3163 39.1221 88.8742 2.2574 40.9456 26.4995 151.8215 22.6619 61.5731 78.0278 73.0226 10.9209 23.0571 32.2386 30.3016 16.0622 23.0131 10.9229 16.9619 12.7830 22.0134 14.5236 0.4463 47.0807 39.3954
temp: 298.150 k
press: 1.00000 atm
elementType: 8 8 8 8 8 6 6 6 6 6 6 6 6 6 6 6 6 6 6 6 6 6 1 1 1 1 1 1 1 1 1 1 1 1 1 1 1 1 1 1
symmnumber: 1
zpe: 824880.7 jmol-1
zpe.correction: 0.314180 hartree
zpe.thermalcorrener: 0.335329 hartree
zpe.thermalcorrenthalpy: 0.336273 hartree
zpe.thermalcorrgfe: 0.262712 hartree
zpe.sumelectzpe: -1033.061627 hartree
zpe.sumelectthermal: -1033.040478 hartree
zpe.sumelectthermalent: -1033.039534 hartree
zpe.sumelectthermalfe: -1033.113095 hartree
dipole: 2.9054 -2.8758 -2.2749
dipole: 4.6783
quadrupole: -114.4373 -117.0348 -127.6823
quadrupole: -2.3325 20.1815 -2.4340
quadrupole: 5.2808 2.6834 -7.9641 -2.3325 20.1815 -2.4340
hfenergy: -1033.3758073 hartree
pointgroup: C01 [X(C17H18O5)]
dipole: 1.1570567 -0.9618146 -1.0601609 debye
polarizability: 307.6942789|-12.1786935|169.2862409|9.7394634|11.4192734|149.9567658 unknown
InChI: InChI=1S/C17H18O5/c1-20-16-13(5-6-14(19)17(16)21-2)11-7-10-3-4-12(18)8-15(10)22-9-11/h3-6,8,11,18-19H,7,9H2,1-2H3
charge 0 multiplicity 1
40 atoms
O  -2.154967 0.057211 1.737882
O  1.849256 1.888681 0.227575
O  4.575843 1.207343 -0.063359
O  -6.70547 0.49008 0.345468
O  5.311457 -1.498168 -0.408561
C  -0.258633 -0.016681 0.09116
C  -1.193309 -0.609682 -0.994032
C  -0.787838 -0.445918 1.480546
C  1.20011 -0.426262 -0.061001
C  -2.655656 -0.337752 -0.664417
C  -3.060044 -0.023754 0.664987
C  2.233124 0.555713 -0.009024
C  1.578466 -1.783226 -0.200028
C  -3.660214 -0.369437 -1.658603
C  -4.406776 0.253207 0.984667
C  3.606942 0.187542 -0.099399
C  2.93033 -2.164466 -0.31507
C  -5.01515 -0.106202 -1.367314
C  -5.377551 0.209304 -0.033245
C  3.943364 -1.181681 -0.27917
C  2.289307 2.907319 -0.753806
C  5.609405 1.094058 0.991255
H  -0.312684 1.085943 0.05226
H  -1.022263 -1.702677 -1.076886
H  -0.938401 -0.181333 -1.981426
H  -0.797419 -1.55227 1.569529
H  -0.179699 -0.019659 2.293762
H  0.806794 -2.559973 -0.233059
H  -3.371658 -0.600996 -2.691475
H  -4.689533 0.49614 2.011622
H  3.197595 -3.221612 -0.440995
H  -5.771034 -0.138299 -2.161894
H  1.869523 2.678643 -1.752523
H  3.3890 2.949011 -0.802187
H  1.874872 3.856452 -0.381324
H  5.424597 -2.468673 -0.562483
H  -7.307951 0.428205 -0.436469
H  6.228049 0.195652 0.832284
H  5.134081 1.065247 1.989897
H  6.218533 2.005272 0.890955
