program: Gaussian 09
title: 000176464
version: EM64L-G09RevD.01
frameworkgroup: C1[X(C8H9NO2)]
method: RPBEPBE
basis: SDD
operation: Freq
keyword: #pfreq=noraman
keyword: PBEPBE/SDD
title: #p freq=noraman PBEPBE/SDD
converged: NO YES NO NO
title: Mulliken charges:
elementType: O O N C C C C C C C C H H H H H H H H H
charge: -0.256982 -0.454657 -0.199139 -0.374751 0.138998 -0.507638 0.100940 0.282969 -0.213390 -0.404846 -0.445187 0.248647 0.247029 0.261943 0.261008 0.258531 0.259417 0.222012 0.205321 0.369773
chargesum: 0.00000
title: Mulliken charges with hydrogens summed into heavy atoms:
elementType: O O N C C C C C C C C
charge: -0.256982 -0.084884 -0.199139 0.120925 0.138998 0.015313 0.100940 0.282969 0.045140 -0.145428 -0.017854
polarizability: 1.15137772e+02 3.34876758e+00 1.23988124e+02 2.53336951e+00 -1.19661710e+00 5.35693306e+01
1716.lowfreq: -13.3102 -7.2998 -0.0005 0.0004 0.0006 9.3112 85.4826 106.9418 122.4132
frequency: 85.4701 106.9335 122.4096 176.2793 182.7474 256.6981 321.6698 437.8091 514.7407 518.3235 552.0932 599.8923 648.8031 654.8897 668.7103 695.3563 761.0769 774.0981 830.2575 857.2064 974.7705 984.3006 986.8835 1007.0904 1028.0211 1032.3835 1070.0659 1168.7219 1171.6219 1208.0544 1213.6450 1216.8863 1263.7413 1292.4006 1312.3484 1347.4718 1405.4913 1413.3450 1432.9150 1444.4807 1457.8227 1464.4033 1493.5770 1558.9073 1614.1744 2915.3895 3011.3663 3029.5010 3057.9112 3064.7280 3091.9340 3205.8616 3232.9574 3324.2635
redmass: 1.9337 4.9252 2.9686 4.6040 5.5447 4.0989 5.4927 5.2905 3.8677 3.0614 5.2661 3.2167 4.7067 1.5354 2.4285 3.9881 1.4445 3.4882 1.4398 1.3807 3.2053 2.6275 2.7743 4.8783 1.8103 2.0688 2.2524 1.2036 1.4436 1.1083 2.2131 1.2916 1.7742 2.0630 1.7555 1.8007 5.0715 1.2385 3.1781 1.1638 2.4521 1.1752 1.2216 7.9763 11.5234 1.0708 1.0580 1.0612 1.0899 1.1069 1.1034 1.0924 1.1042 1.0695
irintensity: 1.0100 4.9662 2.8318 4.1812 5.1697 6.6199 8.4373 1.2124 2.2911 9.0643 2.3211 4.7896 10.7749 156.2132 67.5662 20.2139 56.3349 5.5981 15.2239 0.9397 62.0348 9.4204 4.2029 18.1926 2.7411 29.3352 8.7215 0.3092 12.8636 2.9480 41.6255 1.7686 3.0361 64.2629 9.1667 25.9968 46.5861 71.5328 28.8952 17.0952 7.6728 9.6278 16.5326 32.2617 401.8178 67.1041 43.3193 12.9647 30.0990 8.2010 13.6109 2.6354 1.6824 124.5853
temp: 298.150 k
press: 1.00000 atm
elementType: 8 8 7 6 6 6 6 6 6 6 6 1 1 1 1 1 1 1 1 1
symmnumber: 1
zpe: 414284.1 jmol-1
zpe.correction: 0.157792 hartree
zpe.thermalcorrener: 0.167153 hartree
zpe.thermalcorrenthalpy: 0.168097 hartree
zpe.thermalcorrgfe: 0.122947 hartree
zpe.sumelectzpe: -514.628564 hartree
zpe.sumelectthermal: -514.619203 hartree
zpe.sumelectthermalent: -514.618259 hartree
zpe.sumelectthermalfe: -514.663409 hartree
dipole: -5.5761 3.8020 0.9775
dipole: 6.8194
quadrupole: -59.9969 -66.1810 -65.8726
quadrupole: 6.1871 4.5334 -0.7350
quadrupole: 4.0199 -2.1642 -1.8558 6.1871 4.5334 -0.7350
hfenergy: -514.7863565 hartree
pointgroup: C01 [X(C8H9N1O2)]
dipole: -1.7824314 1.9524468 0.4572342 debye
dipolederiv: -0.6725277 0.302764 -0.0063183 -0.0103022 -1.3421182 -0.0735162 0.0001828 -0.0276564 -0.3407282 -0.5633587 0.114736 -0.1691783 0.1637807 -0.6452334 -0.0927397 -0.0631055 -0.0560428 -0.5179442 -0.7699894 -0.0452113 -0.0973447 -0.0446052 0.2662298 0.0218618 -0.0749397 0.0168567 -0.1259475 0.525646 -0.0428863 0.0322009 0.1000411 0.1028024 0.0047491 0.0310026 -0.0199232 0.307781 -0.2254512 -0.5872558 -0.0711323 -0.495191 -0.9510407 -0.1291563 -0.0815588 -0.123585 -0.0892646 -0.4426579 0.1341478 -0.0680563 0.0639688 -0.0224595 -0.0047329 -0.0808892 0.0094542 0.0903104 1.0248523 0.1686382 0.1372083 0.1475286 1.7595193 0.1428598 0.1253246 0.1423618 0.1882205 0.1606523 0.2297506 0.0410617 -0.0554204 0.3377565 -0.0250724 0.0655613 0.0030349 -0.0454436 0.2387898 -0.2651557 0.0296701 0.1101324 -0.1692461 0.0067597 0.0504032 -0.0364464 -0.1233419 -0.1195689 0.2817846 0.0401697 0.1109807 -0.322068 0.0089375 0.0282228 0.0289981 -0.2319269 0.3335897 0.0058526 0.0704176 -0.0661681 0.4578494 0.1301462 -0.0339172 0.0709387 0.4513611 -0.0187914 0.0105575 -0.0476862 0.0278445 0.0254304 0.0668925 -0.1172302 0.0822904 -0.0577772 -0.0711209 0.031045 0.0516308 0.0336998 0.0415835 -0.0507937 0.1176079 -0.0688586 -0.0180155 0.0809188 -0.0261103 -0.0455943 0.0053782 0.0607362 -0.0403536 -0.0789805 -0.0710228 -0.02727 0.0432258 -0.0535456 0.0606639 -0.0202616 0.045463 0.0468714 0.0967321 0.0667502 0.023474 0.0586947 0.0836739 -0.0135807 0.0497374 0.0142164 -0.0043205 -0.0190952 0.0014443 0.199547 0.013528 -0.0899935 -0.0282946 -0.0698402 0.0348386 -0.020562 -0.0227823 -0.0214591 0.1836156 -0.0741178 -0.0692543 0.0200284 -0.1098407 -0.0041262 -0.0061191 0.0628797 0.0229769 0.0756548 0.0185363 0.0191692 -0.013372 0.1013253 -0.0086572 0.0436778 -0.0582745 0.0084861 -0.2114467 0.4591501 -0.2027065 0.0775063 -0.0427881 0.3185239 -0.0253894 0.0528561 -0.0285978 0.269142 unknown
polarizability: 116.3646987|4.2291282|121.2002892|8.4816278|6.6452731|55.1302387 unknown
InChI: InChI=1S/C8H9NO2/c10-5-6-1-3-9-4-2-7(11)8(6)9/h1,3,10H,2,4-5H2
charge 0 multiplicity 1
20 atoms
O  -0.380468 -2.424543 -0.196925
O  2.393025 -1.622275 -0.485952
N  -0.949923 1.092675 -0.023714
C  -2.36606 0.726336 -0.274584
C  -0.087735 -0.013252 0.026793
C  -2.319621 -0.83364 -0.353665
C  -0.831357 -1.235227 -0.167718
C  1.233885 0.451672 0.240037
C  -0.22636 2.247365 0.148415
C  1.136219 1.87595 0.315906
C  2.443733 -0.446423 0.377579
H  -2.717461 1.180808 -1.217529
H  -3.007862 1.087191 0.54804
H  -2.678919 -1.213922 -1.325429
H  -2.928204 -1.312262 0.433062
H  -0.683995 3.235007 0.141584
H  1.959796 2.572602 0.46979
H  3.358489 0.0983 0.087067
H  2.558854 -0.746689 1.444623
H  1.540862 -2.127172 -0.325382
