program: Gaussian 09
title: 000176448
version: EM64L-G09RevD.01
frameworkgroup: C1[X(C9H8O2)]
method: RPBEPBE
basis: SDD
operation: Freq
keyword: #p
keyword: freq=noraman
keyword: PBEPBE/SDD
title: #p freq=noraman PBEPBE/SDD
converged: YES YES NO NO
title: Mulliken charges:
elementType: O O C C C C C C C C C H H H H H H H H
charge: -0.445775 -0.191396 -0.225575 -0.545731 0.353571 0.140524 -0.012084 -0.373924 -0.360038 -0.209354 -0.219705 0.226168 0.266282 0.244063 0.265694 0.273837 0.231934 0.235608 0.345901
chargesum: 0.00000
title: Mulliken charges with hydrogens summed into heavy atoms:
elementType: O O C C C C C C C C C
charge: -0.099874 -0.191396 0.000593 -0.035386 0.353571 0.140524 -0.012084 -0.108230 -0.086202 0.022580 0.015902
polarizability: 1.29792018e+02 4.39755454e+00 1.14808209e+02 3.32220942e+00 -3.22392925e+00 4.95303871e+01
1716.lowfreq: -8.0580 -2.2607 -0.0007 -0.0004 0.0002 6.4198 78.5711 120.9100 161.2178
frequency: 78.5650 120.9064 161.2166 236.2534 275.6300 293.8751 389.3161 409.9261 484.6843 518.5322 530.2099 566.4662 578.2647 634.2440 723.2725 756.1370 774.6855 798.5384 895.5272 901.7215 965.9388 994.8832 1003.4081 1006.6831 1018.9981 1037.6690 1087.4020 1144.1998 1154.9363 1171.6486 1189.2509 1213.1654 1240.2887 1273.4611 1291.9904 1364.1555 1402.3605 1427.1276 1451.4641 1464.5655 1599.2569 1610.5994 1641.0807 2944.9710 3008.3323 3083.0901 3132.2683 3146.5919 3160.0895 3169.9228 3561.2388
redmass: 3.4172 4.7011 4.6484 4.3872 1.1380 5.9601 2.9568 4.6696 3.2922 5.5123 3.9678 4.4452 3.6289 3.9477 4.8886 4.5604 1.2917 3.1341 1.3809 3.0221 1.5541 2.6529 1.4070 3.2117 3.1823 2.9005 2.2616 1.3089 1.3819 1.1326 1.4792 1.4275 1.6594 1.7978 1.3955 1.6574 5.4380 1.1407 2.5210 2.7015 7.5418 7.4066 11.4840 1.0840 1.0617 1.1006 1.0860 1.0901 1.0955 1.1001 1.0664
irintensity: 4.9219 4.5720 6.6912 4.9000 125.9593 24.0399 4.6333 1.6214 7.2123 4.6170 1.1909 5.7534 6.1333 5.7327 0.7788 4.2376 87.4830 4.6123 0.1881 20.5187 15.0684 18.8737 2.1642 24.1894 64.6279 11.1013 8.0066 0.5537 47.6086 10.3232 46.3059 10.3733 21.8757 62.4429 3.6158 27.3683 13.9505 9.8646 8.8238 5.9873 4.1159 101.6630 198.5646 40.6973 4.5742 14.7038 1.9132 6.5468 13.2050 22.3454 4.7106
temp: 298.150 k
press: 1.00000 atm
elementType: 8 8 6 6 6 6 6 6 6 6 6 1 1 1 1 1 1 1 1
symmnumber: 1
zpe: 383337.4 jmol-1
zpe.correction: 0.146006 hartree
zpe.thermalcorrener: 0.154970 hartree
zpe.thermalcorrenthalpy: 0.155914 hartree
zpe.thermalcorrgfe: 0.111838 hartree
zpe.sumelectzpe: -497.418163 hartree
zpe.sumelectthermal: -497.409198 hartree
zpe.sumelectthermalent: -497.408254 hartree
zpe.sumelectthermalfe: -497.452331 hartree
dipole: -0.4052 -3.0505 1.2543
dipole: 3.3231
quadrupole: -49.7990 -70.4787 -65.6654
quadrupole: -8.5096 2.3911 -3.5100
quadrupole: 12.1820 -8.4977 -3.6844 -8.5096 2.3911 -3.5100
hfenergy: -497.5641682 hartree
pointgroup: C01 [X(C9H8O2)]
dipole: 0.2942231 1.2038161 0.4166379 debye
dipolederiv: -0.2965854 0.0028975 -0.2177345 0.0797262 -0.8047536 0.0832477 -0.2679106 0.2179005 -0.4632107 -0.6726141 -0.2208042 0.0218652 -0.3626332 -1.0529984 0.0525137 0.0167926 0.0433017 -0.3272952 0.3595109 -0.0933153 0.1032972 -0.1478857 0.7055011 -0.0968025 0.1997206 -0.2226901 0.4525484 -0.2497848 0.1733265 -0.0700772 0.2168184 -0.4337462 0.0256431 -0.1089321 0.0273915 0.0472021 0.0962309 -0.0679473 -0.0552129 0.1240532 0.0035878 0.0218871 -0.0878233 0.0769633 -0.0377735 -0.7267303 -0.2662312 0.0477759 -0.1552735 -0.2221977 0.0078284 0.0351965 0.0173332 0.0031196 1.3873918 0.2844108 -0.0454017 0.2592308 1.2396935 -0.0788284 -0.0410463 -0.0792407 0.1386284 -0.2637495 0.0561192 0.0284308 0.0560159 0.1387041 0.0057974 0.050597 -0.0502506 -0.1409761 0.0804584 0.1393278 -0.014766 -0.0966811 0.1001811 0.0180708 -0.0177429 0.0068904 -0.1051792 0.1066147 0.0271218 -0.0326651 0.0781092 0.095615 0.0002144 -0.0386396 0.0074386 -0.1247111 0.0338586 -0.1530229 -0.0314209 -0.1754843 -0.153786 0.0154499 -0.0287308 0.016501 -0.1572884 -0.0165718 0.0339787 0.0248453 0.05589 -0.0603046 -0.0532979 0.0002708 -0.0236844 -0.1720845 0.0851464 -0.0029461 -0.0381825 0.0124223 0.0854767 0.00956 -0.061907 -0.002386 -0.0198047 -0.0286984 -0.0306188 0.0939968 -0.0049408 0.0505 0.0067172 0.1427263 0.0011396 0.0222635 0.1015062 0.0049713 0.0081752 -0.0213432 -0.062462 -0.0115344 0.0151965 -0.0079865 0.1532668 0.0989584 -0.0189508 0.0057909 0.0295932 -0.0381408 -0.0137222 0.0068813 -0.0080409 0.1583025 -0.0781456 -0.0839454 0.0224271 -0.0869049 0.0448467 0.0064266 0.0240069 0.0102483 0.1508856 -0.0797494 0.0812759 0.0298117 0.0873605 0.0417687 -0.0146982 0.0321437 -0.0180982 0.1564745 0.0629531 0.1343524 0.1190449 0.0519271 0.3225145 0.0155273 0.1292004 -0.0127306 0.2656318 unknown
polarizability: 129.9220277|2.7598581|114.3077526|-7.4285882|0.0125095|49.9008337 unknown
InChI: InChI=1S/C9H8O2/c10-8-5-9(11)7-4-2-1-3-6(7)8/h1-4,8,10H,5H2
charge 0 multiplicity 1
19 atoms
O  -1.504976 2.379913 -0.478377
O  -1.658705 -2.422373 0.245247
C  -1.278004 1.241667 0.426151
C  -2.20811 0.017184 0.185761
C  0.122586 0.695666 0.186345
C  0.11549 -0.718184 0.106771
C  -1.28321 -1.222252 0.19209
C  1.329508 1.411058 0.072488
C  1.310277 -1.455024 -0.058642
C  2.528909 0.679864 -0.1046
C  2.522845 -0.74112 -0.161841
H  -1.367902 1.58295 1.480948
H  -2.655837 0.099796 -0.823578
H  -3.027139 -0.095998 0.916217
H  1.333755 2.504847 0.103972
H  1.27715 -2.548117 -0.113403
H  3.480094 1.215953 -0.199824
H  3.467629 -1.27951 -0.294433
H  -2.352761 2.827581 -0.22859
