program: Gaussian 09
title: 000176400
version: EM64L-G09RevD.01
frameworkgroup: C1[X(C7H6N2O7S)]
method: RPBEPBE
basis: SDD
operation: Freq
keyword: #p
keyword: freq=noraman
keyword: PBEPBE/SDD
title: #p freq=noraman PBEPBE/SDD
converged: YES YES NO NO
title: Mulliken charges:
elementType: S O O O O O O O N N C C C C C C C H H H H H H
charge: 0.997245 -0.563667 -0.476730 -0.460974 -0.153459 -0.154581 -0.179531 -0.174778 0.012774 0.022894 -0.413703 0.609236 0.492324 -0.569676 0.463412 -0.503027 -0.788794 0.307914 0.337370 0.296462 0.272919 0.233630 0.392740
chargesum: 0.00000
title: Mulliken charges with hydrogens summed into heavy atoms:
elementType: S O O O O O O O N N C C C C C C C
charge: 0.997245 -0.170927 -0.476730 -0.460974 -0.153459 -0.154581 -0.179531 -0.174778 0.012774 0.022894 -0.413703 0.609236 0.492324 -0.261762 0.463412 -0.165657 0.014217
polarizability: 1.94377275e+02 -9.69235247e-01 1.64725349e+02 5.30821104e+00 8.43888393e+00 8.61332557e+01
1716.lowfreq: -13.3558 -7.7197 -2.2534 -0.0025 -0.0024 -0.0021 23.6630 46.0313 54.3522
frequency: 22.5521 46.0260 54.3431 66.7976 100.7537 115.5777 133.7302 150.9790 165.9115 176.2660 188.6074 202.2964 210.4549 260.2377 291.6090 307.2875 324.7550 336.0321 365.8459 390.9567 430.8743 470.0842 502.3543 516.0208 534.8748 548.0874 602.9612 675.3144 684.9863 717.8841 729.9975 734.4901 834.4924 869.0646 922.8750 932.9356 947.5181 969.5739 990.7536 1022.7353 1057.8705 1072.7832 1099.9372 1182.6482 1204.0821 1214.9173 1246.4376 1358.2158 1381.6300 1393.5351 1404.4310 1417.4145 1435.2153 1457.7384 1483.9071 1572.6668 1604.9582 3004.5832 3094.3982 3113.5797 3176.9705 3187.5907 3470.8595
redmass: 13.5459 9.4192 11.1908 13.9918 1.2783 5.1255 9.2670 4.2198 1.8677 4.1141 7.7756 8.4499 3.3642 4.4275 6.8106 5.6660 8.4015 6.6861 10.4263 8.3863 6.8251 7.5847 5.2786 7.1409 7.3921 6.3638 5.3163 7.5747 12.3228 4.9164 9.2300 5.8105 14.3936 10.4814 6.9342 1.3515 1.5675 6.7452 7.6560 1.4789 1.5355 1.3086 1.4451 3.2625 13.6672 3.3357 3.1393 4.1785 10.1713 7.1981 1.3430 5.5710 3.6244 1.0984 1.0843 6.2409 9.0297 1.0366 1.0976 1.1010 1.0925 1.0933 1.0663
irintensity: 1.4198 2.4785 1.9458 0.5625 17.3228 3.4786 12.8412 23.3688 28.1716 19.2252 1.2204 6.4445 1.1330 0.7596 17.0436 3.4726 12.8075 10.5778 19.8810 44.4507 2.7777 24.8830 29.8769 24.0850 62.8646 23.9581 7.0293 7.7059 29.7739 8.8799 28.4037 8.1722 70.3704 18.1902 0.4354 1.2803 36.1098 86.1047 2.4259 1.1713 32.0690 44.5363 41.0479 13.3303 251.5302 77.5636 16.1347 0.9358 76.8668 84.0351 96.7195 7.7626 58.6190 28.4042 27.1584 6.6087 5.3132 6.3653 1.0194 7.7618 5.8294 25.9546 66.3801
temp: 298.150 k
press: 1.00000 atm
elementType: 16 8 8 8 8 8 8 8 7 7 6 6 6 6 6 6 6 1 1 1 1 1 1
symmnumber: 1
zpe: 359987.8 jmol-1
zpe.correction: 0.137112 hartree
zpe.thermalcorrener: 0.154353 hartree
zpe.thermalcorrenthalpy: 0.155297 hartree
zpe.thermalcorrgfe: 0.090660 hartree
zpe.sumelectzpe: -1302.847459 hartree
zpe.sumelectthermal: -1302.830218 hartree
zpe.sumelectthermalent: -1302.829274 hartree
zpe.sumelectthermalfe: -1302.893911 hartree
dipole: 0.3433 -4.5242 1.1675
dipole: 4.6850
quadrupole: -128.7625 -109.3621 -104.7878
quadrupole: 6.6649 -10.2490 -2.4603
quadrupole: -14.4584 4.9420 9.5164 6.6649 -10.2490 -2.4603
hfenergy: -1302.9845708 hartree
pointgroup: C01 [X(C7H6N2O7S1)]
dipole: -0.264636 1.7757943 0.4171071 debye
dipolederiv: 1.8456857 0.1159675 0.024458 0.1879297 1.3802855 0.0857337 0.1494634 0.1525503 1.4577773 -0.4789684 -0.1911882 -0.0386336 -0.1989121 -0.6667112 -0.1886467 -0.1164479 -0.294209 -0.7807423 -0.6339406 0.0270422 0.0065612 -0.0246327 -0.5335844 -0.0104227 -0.135144 0.0846838 -0.438884 -0.6560369 -0.0396284 0.0194513 -0.0665745 -0.4463254 0.1087543 0.0501758 0.0407829 -0.5580238 -0.3930193 0.0419076 0.2422458 0.1354074 -0.4699441 0.0064791 0.2181174 0.1091224 -0.4641499 -0.2774578 0.0530873 0.13097 0.0050437 -0.6797778 0.2203019 0.1496243 0.1314549 -0.4032353 -0.7325891 0.181129 0.0302024 0.1000787 -0.586981 0.0313894 0.0456564 0.0246273 -0.2107728 -0.662555 -0.1683577 0.0610928 -0.1005738 -0.6285995 0.0527099 0.058065 0.0653271 -0.2131731 0.5857025 -0.3264979 -0.4474942 -0.3123689 1.2409469 -0.2340112 -0.3451542 -0.2666177 0.7467532 1.6793539 0.0328426 -0.1409831 0.045561 1.0251249 -0.0983677 -0.1694501 -0.09564 0.2061258 0.0889499 0.1198718 0.0650159 -0.1548591 -0.0725682 0.0449864 0.1160106 -0.0380453 -0.1925811 -0.3426533 0.351605 -0.056072 0.0825228 0.3524369 -0.0661648 0.0317043 -0.0753121 0.0652408 -0.1807676 0.0043625 0.0426687 0.34393 -0.1720444 0.0615533 -0.057424 0.0593373 0.027816 0.0458636 -0.2944302 0.0299716 0.2528394 -0.1431171 -0.0073527 -0.0395374 0.0356454 -0.0990348 -0.3781364 -0.0366031 0.0404722 -0.1234452 0.1104866 0.0105128 0.0496681 0.0047107 0.1055337 -0.0561747 0.0555935 -0.0008417 -0.1923063 -0.2012195 -0.0052068 -0.0340555 0.0452882 -0.0651301 -0.0671886 -0.1594952 0.0344871 -0.1219347 -0.2077508 0.0004634 -0.0228854 -0.0690231 -0.0273171 0.1131289 0.0309182 -0.0053472 0.0126717 0.0851618 0.0094295 0.0085099 0.0140642 0.1605539 0.1505427 -0.0094259 -0.0121728 0.0272208 0.1408486 0.0026603 0.0413853 -0.0151451 0.1781088 0.1476632 -0.0380082 -0.045958 -0.0450289 0.0856984 -0.0053995 -0.0269874 -0.020411 0.0198399 0.0776753 -0.0090783 0.0897709 0.0135971 0.0849674 -0.0452378 0.0696388 0.0234242 0.0530885 -0.0419104 0.1250632 -0.0623415 0.0421837 0.0419348 0.0377942 -0.0275102 0.0601185 0.1091944 0.1668326 0.1333229 -0.0075239 0.0916501 0.2607315 -0.0119583 -0.0134231 0.023266 0.3230121 unknown
polarizability: 193.3126002|0.7491501|164.0950068|-11.3289928|-11.5761183|87.8282718 unknown
InChI: InChI=1S/C7H6N2O7S/c1-4-2-5(8(10)11)3-6(9(12)13)7(4)17(14,15)16/h2-3,14H,1H3
charge 0 multiplicity 1
23 atoms
S  2.628492 0.673717 -0.120215
O  2.581907 1.983408 1.213841
O  3.409041 -0.560036 0.56571
O  3.124218 1.338117 -1.498507
O  1.841852 -2.085869 -1.119229
O  0.702562 -3.086675 0.597734
O  -4.218089 1.023806 0.26828
O  -3.945738 -1.231136 0.503095
N  0.979681 -2.091791 -0.16426
N  -3.494548 -0.04046 0.31461
C  0.715741 0.445965 -0.139207
C  -0.097365 1.603234 -0.225674
C  0.168798 -0.846843 0.001384
C  -1.497054 1.403195 -0.089116
C  -2.020327 0.119084 0.139283
C  -1.211739 -1.02971 0.179354
C  0.425945 3.00389 -0.465548
H  -2.18196 2.253604 -0.14905
H  -1.638671 -2.026454 0.317389
H  0.869129 3.414311 0.457475
H  1.218998 3.013567 -1.232661
H  -0.392804 3.66352 -0.79333
H  3.442733 1.877557 1.716043
