program: Gaussian 09
title: 000176171
version: EM64L-G09RevD.01
frameworkgroup: C1[X(C17H21NO)]
method: RPBEPBE
basis: SDD
operation: Freq
keyword: #p
keyword: freq=noraman
keyword: PBEPBE/SDD
title: #p freq=noraman PBEPBE/SDD
converged: YES YES NO NO
title: Mulliken charges:
elementType: O N C C C C C C C C C C C C C C C C C H H H H H H H H H H H H H H H H H H H H H
charge: -0.441067 -0.013492 -0.010046 -0.498706 -0.599182 -0.591500 -0.749907 0.442429 0.487609 -0.434537 -0.365759 -0.405303 -0.442954 -0.231705 -0.237298 -0.233142 -0.229239 -0.235953 -0.244798 0.275370 0.205778 0.270826 0.272972 0.203173 0.245659 0.284310 0.206907 0.214959 0.231213 0.258687 0.226012 0.297371 0.257184 0.229964 0.224800 0.227342 0.224465 0.222958 0.227327 0.227270
chargesum: 0.00000
title: Mulliken charges with hydrogens summed into heavy atoms:
elementType: O N C C C C C C C C C C C C C C C C C
charge: -0.441067 -0.013492 0.265324 -0.022102 -0.123036 0.145377 -0.045048 0.442429 0.487609 -0.208525 -0.068388 -0.148118 -0.212989 -0.006905 -0.009956 -0.008677 -0.006281 -0.008626 -0.017528
polarizability: 2.90728552e+02 -3.52022625e+00 1.74919184e+02 -8.19741481e-01 -1.25929091e+01 1.25131466e+02
1716.lowfreq: -2.7672 0.0008 0.0009 0.0009 6.2137 15.3170 28.0001 37.1216 39.8183
frequency: 27.5784 37.0819 39.3449 55.5620 76.4952 97.1371 104.2054 145.6966 192.0884 225.1069 235.1506 240.7266 256.7333 284.7688 316.2282 367.4319 381.9883 393.0985 405.1894 406.0602 450.6020 460.9173 473.7374 491.3305 532.4809 567.0755 616.8623 617.5802 629.1684 682.2620 700.9803 708.7547 754.4733 766.6337 779.1964 817.3115 829.5045 844.9761 853.3394 856.5017 868.2972 903.3252 912.9601 923.6467 925.0565 971.7637 978.7477 989.3489 989.4351 994.7300 995.4603 1017.0103 1026.3764 1028.8704 1039.8265 1055.2779 1086.6136 1101.9454 1140.3715 1144.0088 1154.9802 1171.0461 1171.6253 1186.3200 1186.9139 1212.0404 1216.1046 1226.1968 1249.2114 1289.3539 1312.0172 1323.1952 1328.7354 1334.2115 1352.2886 1383.7124 1384.4486 1388.1803 1406.2113 1439.7043 1441.6351 1442.5274 1457.5600 1462.9827 1472.7938 1481.1494 1481.4697 1483.1471 1486.6044 1590.3809 1592.0595 1612.1484 1613.3195 2964.0037 2983.9810 3003.3609 3018.3609 3025.9533 3040.8665 3074.6851 3089.1823 3100.3300 3107.9570 3112.0694 3116.3975 3120.6425 3125.9067 3130.4911 3140.4946 3141.7269 3155.6412 3157.4615 3160.6005 3171.1291
redmass: 4.3672 4.6019 3.8083 3.8785 3.4206 3.4126 4.0673 3.7411 1.1398 1.8200 2.6964 4.7968 2.4256 4.1060 2.2377 2.2296 2.6534 2.4181 2.7985 2.8433 3.2195 3.5077 3.7877 3.5499 3.1109 5.5926 6.1326 6.2414 3.8971 3.6208 1.6316 1.7529 1.9407 2.8695 2.2723 3.5696 3.2629 2.6602 1.4732 1.2738 2.3779 1.9061 1.5748 1.4745 1.5216 1.4132 1.3794 4.7487 5.6802 1.3934 1.3315 2.1947 2.1721 2.1896 1.7237 1.6690 1.5446 1.5538 1.6809 2.1328 1.6771 1.0545 1.0557 1.1155 1.1154 1.6197 2.2598 1.9268 1.4460 1.3658 1.4223 1.2973 1.2680 1.3337 1.2975 5.5920 5.1238 1.3553 1.1744 1.9350 1.7277 1.2345 1.1363 1.0556 1.0658 1.4300 1.7896 1.5127 1.2373 6.0522 6.0046 6.0912 6.1047 1.0582 1.0366 1.0365 1.0593 1.0892 1.0985 1.0974 1.0992 1.1010 1.0885 1.0869 1.0870 1.0991 1.0868 1.0910 1.0927 1.0959 1.1024 1.0980 1.1014 1.0978
irintensity: 0.1484 0.1242 0.2400 2.4384 0.9748 4.1522 2.8761 1.7325 0.2937 2.0680 3.6642 12.3620 2.3613 11.1470 1.0360 4.2449 7.4012 2.6331 0.2986 0.0703 0.8978 7.7612 9.4992 31.7957 10.1243 1.0155 0.9910 0.0163 3.6505 11.4509 60.8174 58.5239 30.3629 16.9572 24.4935 1.2975 11.2926 7.0091 1.6030 0.2780 2.7875 0.4298 3.9169 2.7346 2.5039 0.9643 0.0255 0.4766 0.0072 0.3332 0.2142 4.7175 6.1169 8.8946 35.1763 3.7359 14.3778 8.1554 4.2188 10.1012 17.0264 0.1786 0.5944 0.1278 4.9625 14.2915 0.7449 28.9861 0.6864 43.3071 13.0329 1.9157 7.4883 0.5867 5.7894 2.1526 0.9642 25.6120 13.5763 13.6840 6.5591 2.6474 11.0721 21.6538 7.8716 4.1255 40.3040 14.6253 3.5411 2.8646 1.6311 3.6013 18.6583 35.4041 13.5929 22.2558 30.7889 5.9989 34.4465 28.6430 30.3257 3.9051 11.3404 11.3703 2.6447 15.9516 2.1014 10.3549 31.2226 40.5216 11.7833 24.0113 29.0254 15.0672
temp: 298.150 k
press: 1.00000 atm
elementType: 8 7 6 6 6 6 6 6 6 6 6 6 6 6 6 6 6 6 6 1 1 1 1 1 1 1 1 1 1 1 1 1 1 1 1 1 1 1 1 1
symmnumber: 1
zpe: 885774.6 jmol-1
zpe.correction: 0.337374 hartree
zpe.thermalcorrener: 0.355376 hartree
zpe.thermalcorrenthalpy: 0.356320 hartree
zpe.thermalcorrgfe: 0.290254 hartree
zpe.sumelectzpe: -788.902138 hartree
zpe.sumelectthermal: -788.884136 hartree
zpe.sumelectthermalent: -788.883192 hartree
zpe.sumelectthermalfe: -788.949258 hartree
dipole: 0.2121 3.9388 0.5545
dipole: 3.9833
quadrupole: -103.5047 -111.7325 -114.3404
quadrupole: 1.2514 0.0874 -0.1727
quadrupole: 6.3545 -1.8733 -4.4812 1.2514 0.0874 -0.1727
hfenergy: -789.2395121 hartree
pointgroup: C01 [X(C17H21N1O1)]
dipole: 0.0989559 -1.5460002 0.2367877 debye
polarizability: 290.6467595|4.6371254|163.9220757|-0.8641164|-24.2614648|136.2103668 unknown
InChI: InChI=1S/C17H21NO/c1-15(13-16-9-5-3-6-10-16)18(2,19)14-17-11-7-4-8-12-17/h3-12,15H,13-14H2,1-2H3
charge 0 multiplicity 1
40 atoms
O  0.582913 1.148422 -0.977207
N  0.65089 -0.236819 -0.631819
C  -0.826853 -0.751284 -0.407009
C  1.496932 -0.419952 0.66682
C  -1.514283 0.145734 0.652109
C  1.280662 -0.989319 -1.792066
C  -0.955535 -2.253768 -0.107051
C  2.953818 -0.058177 0.483828
C  -3.020531 0.198851 0.447702
C  3.955725 -1.053386 0.61645
C  3.339198 1.278826 0.195673
C  -3.562104 0.927766 -0.645536
C  -3.913417 -0.472083 1.321625
C  5.323014 -0.725052 0.471362
C  4.705343 1.603885 0.044089
C  -4.956567 0.980921 -0.858643
C  -5.311436 -0.420884 1.111432
C  5.700433 0.606879 0.183292
C  -5.838054 0.30472 0.018834
H  -1.276093 -0.51745 -1.389495
H  1.398405 -1.466414 1.007798
H  1.003809 0.251467 1.386479
H  -1.068175 1.150922 0.510779
H  -1.284582 -0.219384 1.671775
H  0.602479 -0.88128 -2.651491
H  2.23216 -0.488594 -2.014243
H  1.452165 -2.053541 -1.553676
H  -0.481925 -2.53299 0.85181
H  -0.540137 -2.889128 -0.907991
H  -2.031359 -2.492527 -0.020592
H  3.666879 -2.088384 0.842013
H  2.552611 2.028174 0.066751
H  -2.880997 1.46564 -1.317343
H  -3.511855 -1.030529 2.176931
H  6.087821 -1.501916 0.583247
H  4.995215 2.636284 -0.182218
H  -5.357986 1.554568 -1.702035
H  -5.986638 -0.942318 1.799788
H  6.759646 0.865931 0.072215
H  -6.920793 0.348289 -0.144586
