program: Gaussian 09
title: 000016399
version: EM64L-G09RevD.01
frameworkgroup: C1[X(C6H12O)]
method: RPBEPBE
basis: SDD
operation: Freq
keyword: #pfreq=noraman
keyword: PBEPBE/SDD
title: #p freq=noraman PBEPBE/SDD
converged: YES YES NO NO
title: Mulliken charges:
elementType: O C C C C C C H H H H H H H H H H H H
charge: -0.448404 -0.209045 -0.398799 0.526676 -0.688966 -0.810685 -0.743382 0.193421 0.220118 0.226181 0.210091 0.224329 0.219111 0.222320 0.230674 0.244606 0.336011 0.221917 0.223826
chargesum: 0.00000
title: Mulliken charges with hydrogens summed into heavy atoms:
elementType: O C C C C C C
charge: -0.112393 -0.015624 0.047500 0.526676 -0.035435 -0.113085 -0.297638
polarizability: 7.19524829e+01 5.79095953e+00 6.56301913e+01 5.48128060e+00 5.71265063e+00 6.77325895e+01
1716.lowfreq: -8.8689 -0.0006 -0.0004 0.0008 15.1881 20.5677 69.4519 100.9519 174.8291
frequency: 69.4288 100.8277 174.7685 194.6793 223.2737 267.0521 287.4908 361.2111 395.6023 433.2711 528.7499 565.2887 718.7026 743.8366 828.0102 895.1009 948.9137 953.3795 961.9600 997.7838 1050.3688 1061.0236 1085.5879 1099.5805 1222.2674 1250.5669 1292.7157 1309.4678 1329.5061 1362.4005 1388.8750 1396.0861 1433.5447 1458.5227 1475.2793 1477.3045 1481.9314 1491.8519 1661.8212 2947.8861 2974.8076 2978.1581 3003.3033 3049.5866 3054.3821 3076.8854 3079.3918 3083.9872 3091.3875 3187.1737 3549.3586
redmass: 2.8683 2.2219 1.3435 1.3324 1.6151 3.1155 2.1641 1.0990 2.4212 2.9810 2.5600 2.8443 1.2711 1.7200 1.4223 1.8318 4.9393 1.3205 1.5910 1.3564 1.5523 2.3038 1.5739 1.6023 1.3727 1.2553 1.9356 1.2985 1.5865 1.5314 1.2392 1.2219 1.2007 1.0495 1.0551 1.0436 1.0520 1.0810 4.9043 1.0847 1.0375 1.0360 1.0604 1.1002 1.0951 1.1002 1.1002 1.0627 1.0998 1.1136 1.0660
irintensity: 0.3604 0.5839 0.6578 0.5178 2.0934 2.2407 5.1036 147.2454 3.8955 13.3211 10.8620 5.0534 1.0468 0.3178 9.8595 6.8269 94.2465 69.7247 13.0957 6.0171 6.1579 3.3738 12.2533 12.8466 15.9382 13.6603 1.8404 0.1116 16.4979 8.3751 27.2338 9.7359 3.1019 16.0064 18.5884 12.6022 16.1959 1.9939 15.1022 51.1599 17.5736 31.0106 23.2297 4.5530 18.5039 57.9421 60.2812 9.3171 17.7197 23.9112 3.8171
temp: 298.150 k
press: 1.00000 atm
elementType: 8 6 6 6 6 6 6 1 1 1 1 1 1 1 1 1 1 1 1
symmnumber: 1
zpe: 436962.0 jmol-1
zpe.correction: 0.166430 hartree
zpe.thermalcorrener: 0.175438 hartree
zpe.thermalcorrenthalpy: 0.176382 hartree
zpe.thermalcorrgfe: 0.133260 hartree
zpe.sumelectzpe: -310.450368 hartree
zpe.sumelectthermal: -310.441360 hartree
zpe.sumelectthermalent: -310.440415 hartree
zpe.sumelectthermalfe: -310.483538 hartree
dipole: -0.7985 -0.9820 -0.5169
dipole: 1.3671
quadrupole: -42.7058 -48.3516 -42.4925
quadrupole: -1.9933 0.2026 -1.9645
quadrupole: 1.8108 -3.8350 2.0241 -1.9933 0.2026 -1.9645
hfenergy: -310.6167977 hartree
pointgroup: C01 [X(C6H12O1)]
dipole: 0.3389882 0.36981 -0.1939851 debye
dipolederiv: -0.4030521 -0.0061894 -0.1820294 -0.0250065 -0.899828 -0.0092989 -0.2179964 -0.0509063 -0.394471 0.4409695 -0.059533 0.0225047 -0.0449691 0.672097 -0.0395269 0.0910081 0.0623932 0.2756526 0.0001874 0.042955 0.0537999 -0.0341151 0.0093751 0.0169735 0.0345283 -0.0315365 0.1079594 0.0053721 0.0744169 0.0087819 0.1803991 -0.1063253 -0.021997 -0.0220681 -0.0759882 0.3043713 0.0453448 0.0456467 0.0037409 0.0221904 -0.0323687 0.0169132 0.0196672 0.0031153 0.0765893 0.0128684 -0.0458847 -0.0106513 -0.0374935 0.0387384 -0.0110434 -0.0455131 0.0175206 -0.1874335 -0.1874673 0.1560718 0.1501818 0.158105 -0.3306717 0.0232597 0.1118888 0.0147257 -0.1189557 -0.0059257 0.0023118 -0.0100104 0.0157041 -0.0352317 0.0528917 -0.0622894 0.0397541 -0.2197375 0.0750943 0.0367069 -0.0465666 0.0361288 0.0443169 0.0343506 -0.0165723 0.0402792 -0.1498745 -0.0849016 -0.1073725 -0.0324983 -0.098581 -0.0380791 -0.0328959 -0.0391063 -0.0395152 0.0649717 0.0899309 0.0074646 -0.0189707 0.0094052 0.0569368 0.0112848 -0.0710161 0.0624413 -0.1638322 -0.0116911 -0.136893 -0.063722 -0.1066399 -0.0414324 -0.0276027 -0.0554664 -0.0406898 0.0591362 -0.1262387 0.0847021 0.1050548 0.0676882 0.0563282 -0.0203853 0.1267059 -0.034578 0.0383079 -0.1207058 -0.0833949 -0.0840651 -0.1057872 0.0671979 -0.0296902 -0.008858 -0.0006907 0.0656698 -0.002483 0.1026497 0.0889086 0.086008 0.0391562 -0.0784245 0.0913292 -0.0329816 -0.0090908 0.1269788 -0.0115447 -0.0065082 0.0152787 -0.0677109 0.1041959 0.0163564 0.0541624 0.0542446 0.0757333 0.0914303 0.1581192 0.0626248 0.3136055 0.0204206 0.1761331 0.0220551 0.2401535 0.0973751 -0.0492094 -0.0914338 -0.0539392 0.1446329 -0.0051494 -0.0551745 0.0144817 -0.1090143 -0.0273892 -0.1443342 -0.044636 -0.1470007 0.1092632 -0.0042758 -0.0735561 -0.0240423 0.0653531 unknown
polarizability: 72.804847|5.5579661|65.0844457|-5.6448766|-5.3061246|67.425971 unknown
InChI: InChI=1S/C6H12O/c1-4-6(7)5(2)3/h6-7H,2,4H2,1,3H3
charge 0 multiplicity 1
19 atoms
O  -0.081702 -1.98627 -0.163303
C  -0.275958 -0.542755 -0.469066
C  -1.576813 -0.154912 0.257391
C  0.956161 0.25625 -0.045677
C  -2.024084 1.291553 -0.038588
C  1.305291 0.248809 1.430762
C  1.699772 0.912251 -0.977037
H  -0.420673 -0.411137 -1.564328
H  -1.438621 -0.304792 1.344454
H  -2.358079 -0.86978 -0.062307
H  -2.209958 1.440501 -1.119014
H  -1.257729 2.025905 0.270649
H  -2.960011 1.529133 0.498477
H  2.308217 0.671008 1.612558
H  0.575253 0.843192 2.014212
H  1.271542 -0.781366 1.830655
H  0.750812 -2.287247 -0.610253
H  1.423808 0.907454 -2.039283
H  2.598371 1.478604 -0.705602
