program: Gaussian 09
title: 000176479
version: EM64L-G09RevD.01
frameworkgroup: C1[X(C13H9Cl3N2O5S)]
method: RPBEPBE
basis: SDD
operation: Freq
keyword: #p
keyword: freq=noraman
keyword: PBEPBE/SDD
title: #p freq=noraman PBEPBE/SDD
converged: NO YES NO NO
title: Mulliken charges:
elementType: Cl Cl Cl S O O O O O N N C C C C C C C C C C C C C H H H H H H H H H
charge: 0.003705 0.008179 0.016517 1.050260 -0.218116 -0.278777 -0.598529 -0.768401 -0.567928 -0.247987 -0.461806 0.127660 0.084094 -0.222726 0.482752 -0.263517 0.158097 -0.178703 -0.080348 -0.426850 -0.330317 -0.031020 -0.172184 -0.119328 0.474280 0.324509 0.293464 0.433356 0.269105 0.292584 0.316198 0.262376 0.369402
chargesum: 0.00000
title: Mulliken charges with hydrogens summed into heavy atoms:
elementType: Cl Cl Cl S O O O O O N N C C C C C C C C C C C C C
charge: 0.003705 0.008179 0.016517 1.050260 -0.218116 -0.278777 -0.229127 -0.294121 -0.567928 -0.247987 -0.028450 0.127660 0.084094 0.101783 0.482752 0.029947 0.158097 0.090403 -0.080348 -0.134266 -0.014118 -0.031020 0.090192 -0.119328
polarizability: 7.41494207e+02 1.07153590e+01 2.59897621e+02 -1.38499499e+00 -8.00895917e+00 9.98323869e+01
1716.lowfreq: -0.0014 -0.0007 0.0005 1.5267 3.5060 4.5286 14.8204 23.0255 26.0378
frequency: 14.8006 22.9869 26.0308 31.1803 42.4743 47.2994 55.6881 67.7149 86.3243 94.1624 125.1056 130.3199 154.1702 155.8394 178.2203 187.9069 191.0608 193.2570 227.7754 238.8168 275.5799 281.6387 300.1359 314.2153 328.2117 352.4590 361.6339 393.1242 410.3743 438.6379 441.2500 457.0081 480.9533 505.6822 533.5904 545.2709 564.6409 584.1804 612.6263 621.5410 645.0639 668.6936 698.9408 713.9030 753.9444 766.5064 784.6800 826.5079 835.1565 849.8185 876.5708 879.2495 881.1653 888.5837 910.1505 963.2284 978.4379 997.2233 997.5259 1014.4805 1019.2252 1049.0339 1064.4136 1120.2498 1132.3219 1146.9206 1149.0536 1193.3229 1244.2809 1278.1236 1289.0951 1301.6982 1351.4267 1378.3275 1404.1117 1459.1585 1486.7671 1533.7662 1549.2924 1554.3886 1580.2854 1591.5354 1607.9756 1657.1279 2749.4684 3036.6297 3152.8752 3164.4436 3168.4819 3185.2852 3187.4375 3198.6738 3460.7719
redmass: 14.7690 10.9498 12.0215 11.3824 8.7708 12.7086 10.7570 7.3722 10.3192 11.2049 9.9732 7.5170 14.9105 7.3817 6.5716 12.1988 15.7517 2.2787 7.1482 10.7612 6.2715 9.5548 5.2441 12.7205 2.0910 11.0479 5.5123 10.2286 8.8345 6.5060 3.1881 9.1393 3.1402 9.0525 14.2891 7.1940 5.6194 5.0439 9.8746 10.1495 7.0332 7.4191 3.5295 6.5281 2.7849 8.3249 6.9959 1.6215 1.3399 1.1351 1.6823 7.1806 5.7602 1.4920 6.2035 6.6289 1.3184 5.4092 1.2888 1.2801 2.2158 1.1699 1.2485 2.2531 2.0413 1.3225 4.7578 1.7126 1.5082 1.7512 3.2662 2.8020 4.0596 2.1068 5.4176 3.0125 4.9943 6.3285 9.3639 9.5563 8.3102 6.5706 6.6052 1.4062 1.0725 1.0879 1.0936 1.0893 1.0909 1.0954 1.0967 1.0957 1.0660
irintensity: 0.0259 0.5730 1.2628 1.3782 0.3593 0.6034 0.0997 0.7021 5.2672 7.1393 1.0271 2.2255 0.2800 1.6532 2.0995 6.4010 5.7985 14.6537 0.2802 6.7753 36.1958 5.2138 0.5745 5.7923 120.3528 20.5471 0.2666 16.0290 47.2468 0.3709 9.8816 3.4187 10.8475 31.0046 180.9941 18.9810 4.3424 7.0849 113.4755 105.5792 37.6864 3.4116 2.3795 1.7115 2.3867 15.6123 86.2620 56.8019 22.4815 49.8053 7.8344 92.7784 24.9191 12.4469 164.3825 87.2741 4.0827 58.7276 1.6440 164.9261 136.3842 24.5306 238.0400 210.8307 15.6174 8.4170 58.1109 44.6962 87.1980 125.5836 2.7767 197.0829 41.0816 199.6304 20.0121 46.7547 383.9132 87.8171 39.2175 0.5663 33.1108 182.1032 81.5417 69.9838 1207.5979 1264.5660 1.6864 9.0322 2.4490 6.6291 4.9039 6.2410 28.2869
temp: 298.150 k
press: 1.00000 atm
elementType: 17 17 17 16 8 8 8 8 8 7 7 6 6 6 6 6 6 6 6 6 6 6 6 6 1 1 1 1 1 1 1 1 1
symmnumber: 1
zpe: 529046.6 jmol-1
zpe.correction: 0.201503 hartree
zpe.thermalcorrener: 0.226164 hartree
zpe.thermalcorrenthalpy: 0.227108 hartree
zpe.thermalcorrgfe: 0.142014 hartree
zpe.sumelectzpe: -2762.805309 hartree
zpe.sumelectthermal: -2762.780649 hartree
zpe.sumelectthermalent: -2762.779704 hartree
zpe.sumelectthermalfe: -2762.864799 hartree
dipole: -3.3228 -4.6456 0.6370
dipole: 5.7471
quadrupole: -164.5636 -172.8292 -166.8877
quadrupole: 3.6835 4.9153 2.1687
quadrupole: 3.5299 -4.7357 1.2058 3.6835 4.9153 2.1687
hfenergy: -2763.0068126 hartree
pointgroup: C01 [X(C13H9Cl3N2O5S1)]
dipole: 0.7811535 -2.0992936 -0.3085067 debye
polarizability: 703.0486018|-127.8901338|296.6360105|-30.5714621|16.2349563|101.5396022 unknown
InChI: InChI=1S/C13H7Cl3N2O2.H2O3S/c14-7-1-4-11(12(19)5-7)18-13(20)17-8-2-3-9(15)10(16)6-8;1-4(2)3/h1-6,17H;1-2H
charge 0 multiplicity 1
33 atoms
Cl 6.422267 -3.270983 -0.313826
Cl -5.40206 2.840994 0.52453
Cl -7.101559 0.037952 0.267664
S  1.582658 3.663689 0.175198
O  3.476896 0.951707 0.160751
O  -0.483133 -2.225877 -0.11222
O  1.797194 3.843149 -1.652689
O  0.669741 2.100847 0.227384
O  0.446493 4.72137 0.592972
N  1.155513 -0.449179 0.03043
N  -1.068887 0.05907 0.121477
C  2.270804 -1.161103 -0.055474
C  3.549868 -0.312961 0.02311
C  2.394344 -2.60917 -0.208725
C  -2.471169 -0.005178 0.151256
C  4.834845 -1.013059 -0.062234
C  -0.173817 -0.999627 0.000029
C  3.640879 -3.192842 -0.281607
C  4.848348 -2.379156 -0.206236
C  -3.162191 1.233266 0.299914
C  -3.208304 -1.220838 0.041649
C  -4.564033 1.251698 0.335523
C  -4.612625 -1.179977 0.080432
C  -5.298138 0.046051 0.225735
H  1.27777 1.25643 0.151583
H  1.47778 -3.200942 -0.263119
H  5.745041 -0.410496 -0.008064
H  -0.624837 1.009632 0.192062
H  3.746709 -4.275798 -0.397636
H  -2.604313 2.171116 0.39161
H  -2.675022 -2.16594 -0.071116
H  -5.190265 -2.104937 -0.00299
H  0.938301 4.198794 -2.028775
