program: Gaussian 09
title: 000012668
version: EM64L-G09RevD.01
frameworkgroup: C1[X(C12H18)]
method: RPBEPBE
basis: SDD
operation: Freq
keyword: #p
keyword: freq=noraman
keyword: PBEPBE/SDD
title: #p freq=noraman PBEPBE/SDD
converged: YES YES NO NO
title: Mulliken charges:
elementType: C C C C C C C C C C C C H H H H H H H H H H H H H H H H H H
charge: -0.455796 -0.455633 -0.491447 -0.491752 -0.453757 -0.453738 -0.163875 -0.163945 -0.152605 -0.152614 -0.162759 -0.162719 0.205294 0.205913 0.205322 0.205973 0.211170 0.215150 0.211213 0.215204 0.208983 0.215375 0.209004 0.215434 0.206519 0.206588 0.206715 0.206779 0.204997 0.205004
chargesum: 0.00000
title: Mulliken charges with hydrogens summed into heavy atoms:
elementType: C C C C C C C C C C C C
charge: -0.044589 -0.044338 -0.065127 -0.065335 -0.029398 -0.029299 0.042645 0.042642 0.054111 0.054165 0.042239 0.042285
polarizability: 1.42924618e+02 -1.08906340e-02 1.45253838e+02 8.45569114e+00 1.80694514e-02 8.52962935e+01
1716.lowfreq: -11.2229 -0.0005 -0.0002 0.0004 13.8605 15.3432 93.3115 100.9653 118.9344
frequency: 93.2542 100.9476 118.8868 130.8221 131.3196 205.5356 233.7825 254.4333 283.9517 291.1824 309.6108 360.2794 480.8725 516.6067 533.9494 547.1462 598.7834 601.3151 710.9754 713.2019 742.6474 760.3050 787.7805 797.5338 898.5425 898.7199 945.0178 961.3238 965.0512 972.0766 979.9028 982.4491 993.6386 997.8768 1009.5015 1010.3027 1049.6100 1053.0539 1115.4986 1120.4784 1183.5064 1197.0548 1233.0104 1244.8688 1250.2872 1257.8413 1258.4607 1264.6613 1270.3535 1282.5290 1286.9026 1297.1336 1310.6966 1311.1848 1379.7747 1383.7528 1384.6185 1464.6368 1465.8133 1476.3269 1481.0928 1492.7283 1497.0165 1650.3841 1652.3856 1655.4109 2989.3909 2992.3769 2995.0299 2996.8931 3003.3423 3004.2626 3042.2575 3043.0159 3047.5430 3061.4639 3062.4751 3071.5288 3073.6971 3077.5230 3082.0130 3106.8558 3108.2230 3114.7216
redmass: 2.1543 2.7017 3.1131 3.6875 3.3322 2.3463 3.0626 2.3060 2.0125 2.9588 2.4154 2.7678 3.2379 2.7926 3.3043 2.4233 2.1190 1.8090 1.5011 1.5536 1.3662 1.1980 1.3960 1.4913 2.7989 2.7948 2.2175 1.8221 1.9393 1.5990 1.9718 2.0082 1.8775 3.3158 2.0277 1.9943 1.7851 1.9629 2.5491 1.0716 1.4157 1.3485 1.2468 1.2679 1.1786 1.2250 1.1503 1.1506 1.1054 1.1182 1.0936 1.3225 1.2820 1.3034 1.4491 1.4245 1.4374 1.1062 1.1014 1.1114 1.1006 1.0850 1.0981 6.6844 6.9437 6.8901 1.0605 1.0651 1.0591 1.0594 1.0619 1.0625 1.0959 1.0978 1.0921 1.0941 1.0966 1.0997 1.0862 1.0917 1.0891 1.0977 1.0980 1.0985
irintensity: 0.0929 0.0479 0.0435 0.0178 0.0267 0.0387 0.1556 2.9484 0.0091 0.0003 0.0914 0.0121 0.0000 0.6051 0.7810 0.3910 11.6230 7.8904 15.8561 5.6299 199.3231 0.9345 2.7063 1.7401 0.3564 0.3129 0.6335 1.5339 0.6131 0.6162 0.6647 3.5261 1.2413 0.9026 0.0826 0.1030 3.3958 3.5479 0.1964 0.2004 0.2204 2.2297 0.4105 4.1324 2.7996 2.8004 0.3201 0.4530 0.1636 0.5798 0.7008 3.0207 2.0341 0.1357 0.1783 0.5756 0.2650 0.0204 0.1660 0.8594 1.4065 0.1897 51.2129 0.5561 6.7387 7.1590 16.5307 38.4532 11.5704 5.5280 6.6201 105.4923 0.6084 0.0404 16.4672 16.6811 29.1191 1.1476 5.7347 48.9885 26.9913 135.0674 80.0974 50.9635
temp: 298.150 k
press: 1.00000 atm
elementType: 6 6 6 6 6 6 6 6 6 6 6 6 1 1 1 1 1 1 1 1 1 1 1 1 1 1 1 1 1 1
symmnumber: 1
zpe: 698399.1 jmol-1
zpe.correction: 0.266006 hartree
zpe.thermalcorrener: 0.278132 hartree
zpe.thermalcorrenthalpy: 0.279077 hartree
zpe.thermalcorrgfe: 0.228576 hartree
zpe.sumelectzpe: -467.071596 hartree
zpe.sumelectthermal: -467.059470 hartree
zpe.sumelectthermalent: -467.058526 hartree
zpe.sumelectthermalfe: -467.109027 hartree
dipole: -0.0007 -0.0098 0.0000
dipole: 0.0098
quadrupole: -72.6787 -71.0970 -77.5479
quadrupole: -0.0063 3.9265 0.0117
quadrupole: 1.0958 2.6776 -3.7734 -0.0063 3.9265 0.0117
hfenergy: -467.3376026 hartree
pointgroup: C01 [X(C12H18)]
dipole: -0.0002468 -0.0038433 0.0000044 debye
polarizability: 142.7584197|-0.0216649|145.2536907|9.0030519|0.0516718|85.4626393 unknown
InChI: InChI=1S/C12H18/c1-2-4-6-8-10-12-11-9-7-5-3-1/h1-2,7-10H,3-6,11-12H2
charge 0 multiplicity 1
30 atoms
C  -0.527203 -2.058006 0.572151
C  0.557221 -2.047932 -0.571242
C  -2.157793 0.634306 0.438052
C  2.148965 0.665952 -0.438217
C  -1.398064 1.374178 -0.722934
C  1.37656 1.393022 0.722389
C  -1.940119 -1.89785 0.042501
C  1.967987 -1.868679 -0.042151
C  -2.650668 -0.732713 -0.007391
C  2.662213 -0.693716 0.00691
C  -0.630365 2.619717 -0.303422
C  0.591872 2.628036 0.303356
H  -0.287367 -1.24469 1.279338
H  -0.436048 -3.006045 1.137328
H  0.3051 -1.235584 -1.275096
H  0.479778 -2.99509 -1.139984
H  -3.006134 1.261049 0.771102
H  -1.474916 0.541929 1.301797
H  2.988013 1.305775 -0.76995
H  1.468472 0.563782 -1.302798
H  -2.129275 1.632499 -1.51209
H  -0.703828 0.643953 -1.173762
H  2.102612 1.660504 1.513254
H  0.692034 0.652137 1.170779
H  -2.411053 -2.805545 -0.36521
H  2.451564 -2.769804 0.365322
H  -3.655995 -0.764636 -0.454055
H  3.668152 -0.711213 0.452947
H  -1.101525 3.588767 -0.524564
H  1.049511 3.603396 0.525141
