program: Gaussian 09
title: 000176083
version: EM64L-G09RevD.01
frameworkgroup: C1[X(C10H15NO)]
method: RPBEPBE
basis: SDD
operation: Freq
keyword: #p
keyword: freq=noraman
keyword: PBEPBE/SDD
title: #p freq=noraman PBEPBE/SDD
converged: YES YES NO NO
title: Mulliken charges:
elementType: O N C C C C C C C C C C H H H H H H H H H H H H H H H
charge: -0.449907 -0.698358 0.439492 0.422071 0.100628 -0.572044 -0.568614 -0.620838 -0.584518 0.294492 -0.681426 -0.682886 0.196602 0.220785 0.194349 0.226864 0.219269 0.251128 0.229207 0.214656 0.218986 0.232340 0.214621 0.216684 0.309583 0.310892 0.345942
chargesum: 0.00000
title: Mulliken charges with hydrogens summed into heavy atoms:
elementType: O N C C C C C C C C C C
charge: -0.103966 -0.077883 0.439492 0.422071 0.100628 -0.154658 -0.147401 -0.401569 -0.333390 0.294492 -0.018577 -0.019240
polarizability: 1.42249070e+02 -1.90810339e+00 1.43345849e+02 -8.91292238e+00 3.49119793e-01 7.44540029e+01
1716.lowfreq: -10.7645 -9.3780 -0.0008 -0.0008 -0.0003 8.7386 72.6211 84.5508 91.4681
frequency: 72.5931 84.5133 91.4600 138.7291 159.2990 199.2897 205.4675 208.2598 281.5905 288.6176 289.5918 303.7818 321.5808 352.1405 362.4663 410.2961 450.0224 494.9000 525.4632 562.5396 598.9861 620.5782 745.7493 752.9861 797.4019 808.1380 838.6011 864.1208 876.5537 921.8211 983.5776 989.5023 1049.2929 1055.9132 1061.4233 1066.3480 1127.5016 1137.3927 1175.7957 1229.3864 1233.6637 1267.2003 1276.1616 1306.7209 1311.4686 1341.1629 1388.1719 1390.6053 1397.2969 1458.7905 1469.7278 1471.0939 1474.1967 1482.5388 1492.4046 1497.6027 1502.6505 1605.0699 1626.6329 1647.2059 2958.0135 2958.5616 2979.1476 2979.8694 3027.2095 3032.8238 3073.5292 3074.4354 3082.7241 3083.4313 3098.6753 3148.3948 3586.2936 3592.0111 3728.7762
redmass: 2.5500 2.7182 3.1273 3.0169 5.5598 1.0947 1.0962 1.2964 2.1092 3.7668 1.0989 3.1434 1.9777 1.2519 2.8660 4.5605 6.1055 3.2009 4.9404 2.9985 3.3301 3.3931 2.1880 4.4586 1.1990 1.5714 1.4800 2.5573 1.4655 3.1984 1.9661 2.6785 1.6412 1.9650 1.6819 1.6571 1.5905 1.6488 1.3517 1.4968 1.3587 1.2982 1.9268 1.6307 1.4191 4.2253 1.2572 1.2139 4.3092 2.7633 1.2456 1.0781 1.3062 1.0494 1.2554 1.1119 1.5084 6.7572 2.5956 1.5941 1.0658 1.0661 1.0355 1.0355 1.0950 1.0943 1.0997 1.0997 1.1003 1.1003 1.0909 1.0919 1.0657 1.0448 1.1031
irintensity: 4.2297 0.1310 2.2290 1.3823 41.5603 5.6600 40.1105 147.7085 1.5819 15.8303 139.3366 5.8130 0.9272 0.4398 3.4489 7.4692 0.4621 6.2479 4.2727 5.1823 7.1245 0.9358 7.8556 7.9157 1.7026 22.9226 21.7118 4.5986 20.8199 29.3417 17.7323 7.9895 45.9726 34.8030 1.1279 5.4888 29.7987 74.0623 57.1925 2.0611 15.9652 6.0155 43.3543 3.9803 6.8672 0.3146 16.3518 3.6319 29.6199 99.7181 20.6570 7.3946 1.0947 1.3450 33.7393 28.4412 69.7143 12.7895 73.5782 75.5600 68.9956 19.4291 54.8996 34.2524 12.7798 10.0908 70.5270 42.5984 23.0990 42.7390 23.8610 7.3870 33.1220 28.9362 21.3502
temp: 298.150 k
press: 1.00000 atm
elementType: 8 7 6 6 6 6 6 6 6 6 6 6 1 1 1 1 1 1 1 1 1 1 1 1 1 1 1
symmnumber: 1
zpe: 601410.2 jmol-1
zpe.correction: 0.229065 hartree
zpe.thermalcorrener: 0.242470 hartree
zpe.thermalcorrenthalpy: 0.243414 hartree
zpe.thermalcorrgfe: 0.190261 hartree
zpe.sumelectzpe: -519.124102 hartree
zpe.sumelectthermal: -519.110697 hartree
zpe.sumelectthermalent: -519.109753 hartree
zpe.sumelectthermalfe: -519.162906 hartree
dipole: -1.4461 -2.4438 0.3929
dipole: 2.8666
quadrupole: -65.2288 -66.9767 -77.3956
quadrupole: -6.6155 -2.9969 1.7395
quadrupole: 4.6382 2.8903 -7.5285 -6.6155 -2.9969 1.7395
hfenergy: -519.3531669 hartree
pointgroup: C01 [X(C10H15N1O1)]
dipole: -0.5739728 -0.9583287 0.155329 debye
polarizability: 142.1186926|-1.8733641|143.3667109|-9.3121776|0.6031662|74.5635186 unknown
InChI: InChI=1S/C10H15NO/c1-3-7-5-9(12)6-8(4-2)10(7)11/h5-6,12H,3-4,11H2,1-2H3
charge 0 multiplicity 1
27 atoms
O  0.059246 3.436927 -0.01285
N  -0.000411 -2.224128 -0.00266
C  -1.203239 -0.104128 0.321779
C  1.189231 -0.093912 -0.320118
C  -0.006178 -0.817136 0.00019
C  -2.497009 -0.844047 0.635359
C  2.487008 -0.826203 -0.635577
C  -1.186658 1.311094 0.322525
C  1.167387 1.317314 -0.316902
C  -0.010272 2.0218 0.003598
C  -3.219857 -1.381184 -0.632402
C  3.212478 -1.359917 0.632111
H  -2.304522 -1.684604 1.335233
H  -3.185905 -0.163689 1.169847
H  2.300444 -1.666838 -1.337084
H  3.170358 -0.138996 -1.167231
H  -2.109696 1.851743 0.575991
H  2.070724 1.884937 -0.564444
H  -3.508709 -0.544163 -1.292646
H  -4.135801 -1.939088 -0.362197
H  -2.568268 -2.051733 -1.222268
H  3.494249 -0.52095 1.292745
H  4.133169 -1.909621 0.361389
H  2.566358 -2.036972 1.220821
H  -0.847602 -2.749296 0.181603
H  0.852058 -2.73971 -0.189614
H  -0.818382 3.825101 0.225401
