program: Gaussian 09
title: 000176098
version: EM64L-G09RevD.01
frameworkgroup: C1[X(C15H20O4)]
method: RPBEPBE
basis: SDD
operation: Freq
keyword: #pfreq=noraman
keyword: PBEPBE/SDD
title: #p freq=noraman PBEPBE/SDD
converged: YES YES NO NO
title: Mulliken charges:
elementType: O O O O C C C C C C C C C C C C C C C H H H H H H H H H H H H H H H H H H H H
charge: -0.430508 -0.480797 -0.181954 -0.184748 0.276280 0.131537 -0.648705 -0.162467 0.069713 0.156461 0.158548 -0.557742 -0.766041 0.392834 -0.651698 -0.167317 -0.211271 -0.771506 -0.758951 0.251611 0.235106 0.232181 0.226984 0.253177 0.262452 0.224733 0.209369 0.248957 0.251961 0.161154 0.360626 0.354697 0.192390 0.223129 0.215169 0.217140 0.213666 0.246381 0.207450
chargesum: 0.00000
title: Mulliken charges with hydrogens summed into heavy atoms:
elementType: O O O O C C C C C C C C C C C C C C C
charge: -0.069882 -0.126100 -0.181954 -0.184748 0.276280 0.131537 -0.161988 0.069714 0.069713 0.156461 0.158548 -0.077582 -0.069487 0.392834 -0.150780 -0.006164 -0.018881 -0.116068 -0.091453
polarizability: 2.05408528e+02 -8.90013829e+00 1.72861728e+02 -2.86543364e+00 -1.87991957e+00 1.34215187e+02
1716.lowfreq: -15.9748 -12.7338 -0.0007 -0.0005 -0.0005 6.0532 29.8089 54.4635 82.0295
frequency: 28.1137 54.3885 81.9861 89.4172 108.9610 133.0750 158.4919 165.8173 180.6620 195.5205 199.6984 221.9203 236.8027 254.3233 265.7771 281.8426 283.4901 291.0788 308.2000 323.0332 340.7473 351.2103 378.5776 393.2007 398.1153 414.8704 461.1058 479.5816 516.1066 530.8926 548.7375 575.7088 620.9851 639.3042 688.0607 734.3642 737.7839 770.3853 802.1936 807.8179 866.4487 884.0459 897.1297 919.4593 930.9384 938.1918 944.7907 954.4732 966.6284 971.2460 972.5353 994.9521 1014.6536 1029.5228 1045.6770 1061.8488 1082.7230 1104.2299 1108.6106 1131.3306 1160.6901 1183.4478 1193.6059 1221.7935 1227.9162 1245.8360 1261.4970 1280.8909 1284.5093 1307.0873 1314.4016 1342.5272 1362.4113 1373.5051 1377.0941 1379.1569 1392.8395 1394.6837 1397.9430 1444.6126 1450.2504 1462.2109 1464.8145 1471.3365 1472.0141 1480.8310 1484.2413 1490.6765 1587.5291 1618.8630 1636.2383 2883.4207 2914.4328 2966.6292 2973.3180 2982.3799 2984.6784 3000.9855 3025.2659 3029.0326 3061.2912 3064.4223 3067.6949 3077.6224 3081.4286 3087.8406 3090.4110 3092.5972 3189.4517 3452.6180 3559.2624
redmass: 2.9487 5.3292 3.7223 4.5677 3.7717 5.3380 7.1123 3.0628 2.8125 1.6503 1.9471 2.4598 1.2015 1.4980 3.1408 2.4320 1.7828 3.1184 1.9454 2.7159 3.2096 2.7284 2.6559 2.3850 2.8325 2.8178 2.9445 2.7446 3.6309 3.7563 1.2359 4.3324 3.8807 4.0466 3.6666 4.6736 4.2595 4.3227 4.4882 4.0214 2.2167 2.2856 1.4438 1.9533 1.6543 1.4611 2.4030 1.9869 2.0478 1.9722 2.4000 1.8527 1.8872 2.2098 1.3301 3.0228 1.6012 1.8802 1.7941 2.1939 1.5238 2.4321 2.1040 2.2246 1.3807 2.4374 2.4964 2.2707 2.1206 2.0065 3.0346 2.3319 1.4859 1.2163 1.2621 1.2660 1.2714 1.2389 1.3930 1.0766 1.0824 1.1876 1.0547 1.0541 1.0543 1.0544 1.0732 1.0533 8.3857 8.8544 10.0116 1.0851 1.0852 1.0353 1.0367 1.0598 1.0364 1.0647 1.0843 1.1012 1.0997 1.0996 1.0989 1.0989 1.0990 1.0606 1.0989 1.0975 1.1121 1.0641 1.0664
irintensity: 1.6388 8.3104 9.1264 1.4207 4.5143 3.6181 0.4225 0.9428 16.7433 0.9605 18.7092 30.2154 0.2468 0.3007 6.1155 0.3167 0.1507 5.4852 3.0490 10.3252 1.0457 4.9215 0.7419 2.0756 1.8796 4.9814 2.1643 3.6071 18.1838 22.3398 153.6784 2.3188 1.0101 5.3138 12.1204 34.4540 35.8617 7.6636 25.0029 8.3253 4.6774 0.8765 25.2512 2.8261 7.6033 1.8301 15.3448 5.6500 7.6412 15.2907 37.7334 43.0404 18.3357 42.3741 9.0138 10.2307 5.5056 6.9548 17.5054 23.6099 3.4583 10.5684 14.9058 6.5435 63.0386 7.0806 103.8618 11.8273 9.7101 4.5432 20.2322 7.1985 4.6649 21.2106 59.2445 12.8193 5.4471 18.4609 9.5630 15.3318 4.2768 16.7236 4.2998 5.4019 7.3312 7.4835 12.7115 11.6475 144.3264 199.1488 33.3987 109.6456 77.1412 27.7335 40.5238 20.7420 23.3787 10.3457 17.6959 8.5565 2.4068 36.1679 55.0510 15.6629 20.1317 14.2439 22.9981 17.8396 14.5163 29.4694 6.3212
temp: 298.150 k
press: 1.00000 atm
elementType: 8 8 8 8 6 6 6 6 6 6 6 6 6 6 6 6 6 6 6 1 1 1 1 1 1 1 1 1 1 1 1 1 1 1 1 1 1 1 1
symmnumber: 1
zpe: 832732.6 jmol-1
zpe.correction: 0.317171 hartree
zpe.thermalcorrener: 0.336868 hartree
zpe.thermalcorrenthalpy: 0.337812 hartree
zpe.thermalcorrgfe: 0.270738 hartree
zpe.sumelectzpe: -882.972080 hartree
zpe.sumelectthermal: -882.952384 hartree
zpe.sumelectthermalent: -882.951440 hartree
zpe.sumelectthermalfe: -883.018513 hartree
dipole: -3.5600 1.4977 -1.6090
dipole: 4.1840
quadrupole: -115.8989 -130.5968 -112.6230
quadrupole: 19.0497 -6.0523 -0.5596
quadrupole: 3.8073 -10.8906 7.0833 19.0497 -6.0523 -0.5596
hfenergy: -883.2892513 hartree
pointgroup: C01 [X(C15H20O4)]
dipole: 1.4040806 -0.5577296 -0.6535583 debye
polarizability: 205.5135386|-8.8026187|172.5703084|2.5376191|3.2791143|134.4015959 unknown
InChI: InChI=1S/C15H20O4/c1-12(2)4-9-10(5-16)14(8-17)7-13(14,3)11(18)15(9,19)6-12/h5,8,11,18-19H,4,6-7H2,1-3H3
charge 0 multiplicity 1
39 atoms
O  0.136374 -3.124018 -0.133726
O  1.264278 -1.194096 -1.589082
O  -3.123162 1.419026 1.481779
O  -2.047198 3.02202 -0.807003
C  -1.599998 -1.363005 -0.011196
C  -1.871436 0.183171 -0.203566
C  -2.011414 -0.822832 -1.374572
C  -0.154202 -1.76555 0.339206
C  0.95728 -0.804913 -0.154348
C  -0.691939 1.115931 -0.168255
C  0.607198 0.672533 -0.112855
C  2.290744 -0.892514 0.607013
C  -2.606342 -2.2225 0.756514
C  3.045256 0.455321 0.33779
C  1.893003 1.484269 0.015561
C  -3.121615 0.673924 0.472328
C  -0.961528 2.566288 -0.356639
C  3.844522 0.894835 1.588685
C  4.01103 0.3205 -0.868634
H  -3.029015 -1.055558 -1.70995
H  -1.292782 -0.745644 -2.194312
H  -0.094062 -1.830607 1.441486
H  2.078293 -0.997368 1.688505
H  2.872189 -1.774737 0.290804
H  -2.332473 -3.283314 0.617034
H  -2.584312 -1.998755 1.839253
H  -3.641786 -2.084402 0.401394
H  2.121441 2.052616 -0.906607
H  1.799253 2.232133 0.825897
H  -4.077469 0.277231 0.046546
H  0.486401 -3.010148 -1.06161
H  0.78322 -0.58163 -2.20221
H  -0.114298 3.251775 -0.119514
H  4.603238 0.135383 1.855532
H  4.374779 1.848827 1.407608
H  3.181225 1.033354 2.463385
H  4.819578 -0.399377 -0.6415
H  3.477868 -0.045819 -1.76249
H  4.482364 1.293453 -1.105049
