program: Gaussian 09
title: 000176162
version: EM64L-G09RevD.01
frameworkgroup: C1[X(C23H30NO3)]
method: RPBEPBE
basis: SDD
operation: Freq
keyword: #p
keyword: freq=noraman
keyword: PBEPBE/SDD
title: #p freq=noraman PBEPBE/SDD
converged: YES YES NO NO
title: Mulliken charges:
elementType: O O O N C C C C C C C C C C C C C C C C C C C C C C C H H H H H H H H H H H H H H H H H H H H H H H H H H H H H H
charge: -0.230688 -0.206432 -0.442575 -0.127018 0.004405 -0.035994 -0.488257 -0.501820 -0.381525 -0.611114 -0.739138 -0.735999 -0.293722 0.201098 -0.087486 0.339831 0.319526 -0.372430 -0.393064 -0.345314 -0.367867 -0.239080 -0.226560 -0.238455 -0.238524 -0.232865 -0.241538 0.278997 0.285334 0.263958 0.265138 0.263590 0.272234 0.276459 0.292633 0.277837 0.273273 0.277210 0.268045 0.241653 0.241908 0.235973 0.260252 0.266312 0.255742 0.247007 0.369723 0.268343 0.283651 0.234210 0.272195 0.241178 0.236804 0.238007 0.239980 0.244043 0.240915
chargesum: 1.00000
title: Mulliken charges with hydrogens summed into heavy atoms:
elementType: O O O N C C C C C C C C C C C C C C C C C C C C C C C
charge: -0.230688 -0.206432 -0.072852 -0.127018 0.283402 0.249340 0.040839 0.034005 0.187567 0.217206 0.012468 0.026538 0.209027 0.201098 -0.087486 0.339831 0.319526 -0.104087 -0.109413 -0.111104 -0.095672 0.002098 0.010244 -0.000448 0.001456 0.011178 -0.000623
polarizability: 2.85770483e+02 1.32700786e+01 2.71253791e+02 1.83457354e+01 5.65265082e+00 2.02264663e+02
1716.lowfreq: -26.5866 -6.3052 -3.6726 -0.0004 0.0008 0.0011 4.0489 10.1992 20.9716
frequency: -23.2506 9.6700 20.9238 31.1304 40.2814 45.4458 66.7272 82.1583 87.2532 95.5275 119.8082 133.8578 145.7000 154.0380 169.6917 190.2557 219.0744 222.7444 237.5437 243.9832 264.3389 267.4170 289.8576 295.6167 307.9786 311.5627 331.7330 341.1194 368.9916 386.4603 393.5824 399.8385 406.6149 428.3915 444.9031 457.7690 491.8774 520.4016 563.8831 594.1559 613.4681 615.0516 618.5834 640.1863 662.5428 680.9574 695.8702 703.3116 713.6227 750.4588 771.6942 776.7988 784.8203 798.1864 813.5775 852.0865 858.0204 866.5091 869.8782 896.5173 904.6927 916.0702 929.9327 944.9887 949.3934 969.5980 980.0695 982.0518 988.2253 989.3473 990.6332 991.9774 994.4874 1005.8771 1007.6791 1019.1943 1026.8933 1030.5719 1042.5952 1067.0336 1081.8953 1083.3469 1088.8124 1089.3989 1100.7457 1123.2971 1135.3675 1159.7294 1162.0516 1166.7728 1174.8829 1179.3215 1180.4643 1187.9699 1195.8544 1198.2849 1229.6030 1231.6775 1241.4861 1259.9465 1281.9183 1309.6992 1311.3862 1314.4877 1316.6241 1322.7271 1325.2970 1341.4703 1347.0703 1362.4079 1378.0597 1381.4025 1395.9748 1408.4426 1416.2790 1432.2214 1433.3835 1438.3554 1460.5429 1470.4944 1471.3506 1474.1009 1475.3280 1479.4960 1482.7703 1485.8435 1488.0699 1494.1001 1498.8498 1503.7065 1588.1244 1591.3936 1604.8105 1610.2694 1637.8033 3000.2223 3002.0602 3002.6820 3024.1852 3032.7378 3035.4037 3036.6583 3052.6449 3053.3782 3065.6924 3083.8089 3091.8314 3094.2428 3101.9338 3105.1656 3109.4949 3126.1132 3128.0250 3134.5141 3134.9708 3140.2006 3145.2748 3147.7011 3150.8962 3155.7380 3159.7928 3162.1685 3172.3638 3173.4288 3556.5709
redmass: 3.5078 4.3923 3.9257 4.9496 3.8030 5.0863 4.8186 4.5164 2.2732 3.7952 2.8998 3.8496 3.9347 1.3493 2.9854 3.6439 4.6086 1.0607 1.3046 4.0338 3.9212 1.5087 4.5519 2.0164 1.8753 4.8723 2.9462 4.0236 2.3262 3.2002 3.0502 2.8220 2.8903 3.2723 2.8757 5.6479 3.7724 2.9826 4.0851 3.4123 6.0508 6.3821 6.1990 3.5974 5.6387 3.3771 5.9328 1.7074 2.0789 3.0763 2.2521 1.9825 2.7087 1.3170 1.3793 1.2511 2.3369 3.3527 1.3071 3.0497 6.5098 1.8390 1.4818 1.4382 1.4951 5.0262 2.5847 1.4189 5.0108 4.4490 2.6486 6.1063 1.5094 1.3270 1.3178 1.4007 2.2118 2.1997 1.7179 1.8992 2.5204 1.8022 1.8262 1.7853 2.7594 1.7538 1.8063 2.2065 2.7738 1.8880 1.1213 1.0529 1.4249 1.2449 2.0688 1.2009 1.5207 1.4045 1.1712 1.3853 1.1554 1.4077 1.4607 1.3063 1.4359 1.3998 1.3344 1.3246 1.4539 1.3620 7.8668 9.1235 1.3808 1.2009 1.1981 1.1517 2.1856 2.2141 1.0664 1.0591 1.0580 1.0489 2.1722 1.0642 2.1886 1.0538 1.0544 1.0639 1.0743 1.0633 6.0000 6.2490 6.0140 5.9853 12.2006 1.0373 1.0389 1.0571 1.0654 1.0781 1.0386 1.0671 1.0843 1.0623 1.1034 1.1026 1.0977 1.0982 1.1027 1.1014 1.1015 1.1056 1.0863 1.0856 1.0882 1.0878 1.1043 1.0934 1.0923 1.1042 1.0964 1.0961 1.0991 1.1016 1.0666
irintensity: 0.1502 0.5196 0.7003 0.6216 2.2644 1.1500 3.1956 2.0843 0.3787 4.0735 1.2960 1.3867 14.4197 90.0935 3.8029 8.8798 2.0183 0.2996 0.0335 0.9574 4.2069 0.2804 0.4151 1.4093 0.4429 3.5735 5.3982 2.1592 1.1743 4.0020 1.3623 0.0548 0.4192 1.3367 5.0617 1.7246 8.0101 3.2058 14.6577 10.4135 3.3076 2.4946 12.3140 6.8592 19.6698 8.0044 6.6680 57.0355 48.4309 73.8475 10.9925 46.5948 12.3942 3.0403 5.1971 0.2018 2.0405 26.8454 3.1122 30.9863 16.1297 7.6825 3.1138 2.2788 0.7174 75.9258 87.7701 1.9328 5.9979 6.2708 2.1825 10.7518 1.0366 0.2560 1.0376 12.2997 6.0152 5.1955 10.3397 29.7416 89.9295 6.7070 17.5318 32.6742 400.9598 1.5316 7.9847 3.9293 8.7959 1.4863 0.1557 0.3332 3.8054 8.9777 19.8763 1.2526 3.5126 2.5938 4.4783 5.8011 1.3425 19.6905 2.2061 9.5608 19.1134 7.8616 1.6546 7.0492 3.0037 2.8125 0.1457 0.0962 3.7829 27.6397 19.1605 33.5913 19.4443 12.7594 7.3255 17.4180 17.2312 6.9168 12.7421 24.2335 14.9358 10.1457 19.8319 5.1798 31.7703 1.8385 0.2434 0.3432 3.9670 0.6872 134.3711 4.4735 1.4150 30.9730 7.6671 6.8561 1.0279 13.8781 9.6178 1.1559 12.3669 0.0817 6.6234 6.6958 3.8078 26.8189 19.9179 5.0658 1.8158 2.4080 3.1448 0.6004 4.6502 16.0706 12.4382 6.5568 21.9677 11.9054 16.8196 11.8928 20.6330
temp: 298.150 k
press: 1.00000 atm
elementType: 8 8 8 7 6 6 6 6 6 6 6 6 6 6 6 6 6 6 6 6 6 6 6 6 6 6 6 1 1 1 1 1 1 1 1 1 1 1 1 1 1 1 1 1 1 1 1 1 1 1 1 1 1 1 1 1 1
symmnumber: 1
zpe: 1267328.8 jmol-1
zpe.correction: 0.482700 hartree
zpe.thermalcorrener: 0.508843 hartree
zpe.thermalcorrenthalpy: 0.509787 hartree
zpe.thermalcorrgfe: 0.424649 hartree
zpe.sumelectzpe: -1172.602140 hartree
zpe.sumelectthermal: -1172.575998 hartree
zpe.sumelectthermalent: -1172.575054 hartree
zpe.sumelectthermalfe: -1172.660191 hartree
dipole: 15.8006 -1.2320 0.0468
dipole: 15.8486
quadrupole: -39.0903 -132.3918 -151.5333
quadrupole: -6.2805 -3.0909 -2.2764
quadrupole: 68.5815 -24.7200 -43.8615 -6.2805 -3.0909 -2.2764
hfenergy: -1173.0848405 hartree
pointgroup: C01 [X(C23H30N1O3)]
dipole: 6.2004546 -0.2540091 0.6074008 debye
polarizability: 284.4368823|24.1128278|247.8581828|8.2445442|-32.2534518|226.993872 unknown
InChI: InChI=1S/C23H30NO3/c1-18-14-15-19(2)24(18,3)16-17-27-22(25)23(26,20-10-6-4-7-11-20)21-12-8-5-9-13-21/h4-13,18-19,26H,14-17H2,1-3H3
charge 1 multiplicity 1
57 atoms
O  0.339827 -0.24976 0.673059
O  -0.832378 -1.904738 -0.449575
O  -1.843091 0.765747 1.704168
N  4.079089 -0.51722 0.485657
C  5.144985 0.495161 1.053452
C  4.348911 -0.454339 -1.069133
C  6.397457 0.234493 0.181551
C  5.899873 -0.425239 -1.143922
C  2.668102 -0.095601 0.899163
C  4.358562 -1.933438 0.977955
C  5.371683 0.402111 2.564693
C  3.697422 0.758543 -1.753396
C  1.561525 -1.015781 0.364215
C  -0.84791 -0.824709 0.172341
C  -2.057669 0.11485 0.389711
C  -3.386747 -0.652144 0.41986
C  -1.943126 1.14859 -0.759822
C  -4.563156 -0.075244 -0.122128
C  -1.61643 2.494258 -0.476048
C  -3.483331 -1.881836 1.123035
C  -2.12879 0.738283 -2.105377
C  -5.810713 -0.720884 0.027787
C  -1.501475 3.431835 -1.528437
C  -4.728335 -2.527348 1.268501
C  -2.005769 1.675115 -3.154361
C  -5.897421 -1.948989 0.720478
C  -1.695192 3.026263 -2.869149
H  4.710903 1.4822 0.810613
H  3.930061 -1.385031 -1.489005
H  7.112366 -0.418758 0.710993
H  6.918349 1.18748 -0.005833
H  6.21713 0.1468 -2.030023
H  6.313011 -1.441517 -1.256085
H  2.639763 -0.074957 2.000951
H  2.497128 0.928365 0.533722
H  4.110447 -2.004488 2.046956
H  3.739616 -2.642131 0.408496
H  5.419456 -2.175438 0.827223
H  6.085857 1.195455 2.847884
H  4.455242 0.576162 3.154395
H  5.822708 -0.557784 2.867852
H  4.082891 1.721915 -1.376308
H  2.596872 0.764249 -1.69353
H  3.956043 0.707085 -2.825592
H  1.520903 -1.996125 0.871048
H  1.625519 -1.190912 -0.726438
H  -2.734878 0.877292 2.123518
H  -4.506979 0.874016 -0.664532
H  -1.462754 2.790121 0.565778
H  -2.586256 -2.34159 1.551299
H  -2.379396 -0.305239 -2.33033
H  -6.711457 -0.265582 -0.397068
H  -1.268207 4.477987 -1.300971
H  -4.788847 -3.479776 1.805604
H  -2.163161 1.354967 -4.190086
H  -6.864148 -2.451479 0.831875
H  -1.612384 3.755035 -3.682885
