program: Gaussian 09
title: 000176049
version: EM64L-G09RevD.01
frameworkgroup: C1[X(C7H10NO4P)]
method: RPBEPBE
basis: SDD
operation: Freq
keyword: #p
keyword: freq=noraman
keyword: PBEPBE/SDD
title: #p freq=noraman PBEPBE/SDD
converged: YES YES NO NO
title: Mulliken charges:
elementType: P O O O O N C C C C C C C H H H H H H H H H H
charge: 1.179929 -0.671760 -0.698548 -0.634338 -0.428805 -0.533984 -0.624113 0.519288 -0.407367 -0.313925 -0.381574 -0.360069 0.288077 0.309497 0.236154 0.281697 0.319925 0.308949 0.223697 0.256256 0.385939 0.389133 0.355941
chargesum: 0.00000
title: Mulliken charges with hydrogens summed into heavy atoms:
elementType: P O O O O N C C C C C C C
charge: 1.179929 -0.285821 -0.309415 -0.634338 -0.072864 0.094889 -0.314616 0.519288 -0.171213 -0.032228 -0.157877 -0.103813 0.288077
polarizability: 1.60974541e+02 6.71993840e+00 1.04474362e+02 -6.27678567e+00 1.14888820e+01 9.76939268e+01
1716.lowfreq: -4.9637 -0.0013 0.0012 0.0014 4.9110 9.0317 31.2969 35.1509 66.1701
frequency: 30.8346 35.0291 66.1483 81.9596 123.8845 153.7197 188.2594 201.5312 248.9616 250.8766 281.3663 321.3213 348.4127 354.5664 373.0955 393.0279 407.2412 409.7595 434.7476 508.0645 557.7725 577.6215 612.8817 646.6310 679.9277 700.1342 730.7011 751.9581 809.4203 822.3898 842.5634 934.7971 963.3450 966.5090 987.4262 1004.0457 1047.6048 1081.3190 1108.8447 1144.7118 1168.8714 1184.5875 1190.3629 1252.3427 1279.1123 1320.0348 1360.1856 1395.6739 1428.8806 1508.3887 1594.5217 1627.5673 1634.9329 3049.0740 3117.4558 3129.2461 3145.9124 3173.4698 3495.8392 3580.8601 3581.3648 3601.2205 3634.2712
redmass: 4.3596 5.2767 6.1754 5.5825 5.7518 2.1921 4.3644 5.1063 3.7350 5.1273 1.6324 1.9031 3.3604 1.2702 1.1112 4.2469 4.3983 2.9172 4.4283 4.2042 2.4415 1.4685 5.9000 8.0541 5.6349 9.5018 3.9655 3.6524 1.3835 4.6700 1.5727 1.3783 1.9662 1.3583 1.2074 2.9241 2.3282 1.7110 1.6016 1.3777 1.9227 1.1220 1.5061 2.5549 1.7479 1.2890 1.5525 5.0145 2.9028 2.7887 6.1591 4.1437 1.2124 1.0872 1.0884 1.0912 1.0963 1.0950 1.0445 1.0660 1.0662 1.0663 1.1010
irintensity: 0.8630 1.7243 7.5220 14.9366 2.3863 30.6118 23.5088 27.9737 33.6524 25.1872 126.4475 21.0946 76.2403 26.1840 141.6907 2.0854 80.0542 0.8423 1.4651 13.5251 26.6811 366.7571 95.9665 150.2120 50.5549 190.1572 17.5240 34.0662 21.1239 12.5929 40.9663 0.6860 1.3113 1.1936 71.0880 3.1183 115.2248 13.7834 45.1133 244.8581 41.4283 9.6337 15.5410 32.2058 17.7737 20.3404 3.6259 23.2488 13.6433 67.3410 15.4137 83.8618 48.9429 5.6103 16.2602 1.0299 11.3693 3.5430 22.9581 41.1121 50.5186 36.6607 12.9338
temp: 298.150 k
press: 1.00000 atm
elementType: 15 8 8 8 8 7 6 6 6 6 6 6 6 1 1 1 1 1 1 1 1 1 1
symmnumber: 1
zpe: 440450.6 jmol-1
zpe.correction: 0.167759 hartree
zpe.thermalcorrener: 0.182376 hartree
zpe.thermalcorrenthalpy: 0.183320 hartree
zpe.thermalcorrgfe: 0.125468 hartree
zpe.sumelectzpe: -968.625221 hartree
zpe.sumelectthermal: -968.610604 hartree
zpe.sumelectthermalent: -968.609660 hartree
zpe.sumelectthermalfe: -968.667512 hartree
dipole: -1.2225 1.7438 1.5130
dipole: 2.6124
quadrupole: -69.7551 -86.8447 -81.8598
quadrupole: -2.7361 -7.9335 -3.8118
quadrupole: 9.7314 -7.3582 -2.3732 -2.7361 -7.9335 -3.8118
hfenergy: -968.7929798 hartree
pointgroup: C01 [X(C7H10N1O4P1)]
dipole: 0.4789623 0.8978959 -0.1439338 debye
dipolederiv: 1.9605515 -0.0341942 0.0164598 -0.1826283 1.1359649 -0.2123086 0.1109165 -0.0677469 1.4864503 -0.7296453 -0.0857433 -0.1283466 -0.1130018 -0.3822737 0.1182998 -0.2049731 -0.0025615 -1.3211977 -1.331455 0.1956799 0.0680595 0.2804499 -0.5716965 0.0503803 0.1501509 0.0805873 -0.5869753 -0.809814 -0.1350054 -0.0868191 -0.0328212 -0.7858653 -0.0502846 -0.1209652 -0.0215491 -0.6098419 -1.5187664 0.2558613 0.1392253 0.3214442 -0.1497556 -0.138556 0.1648934 -0.1331355 -0.4172847 -0.5393408 -0.1482718 0.0091638 -0.1950547 -0.5040042 -0.3258521 -0.1581494 -0.4045205 -1.0140857 0.6018864 0.1394862 0.1245695 0.1890754 0.2251558 0.3115075 0.3336395 0.4673716 0.9985154 -0.1434111 -0.0076639 0.0297598 -0.1269101 -0.192718 -0.0379908 -0.1505757 -0.0000567 -0.1279705 0.1199161 0.0361576 -0.0923429 0.0309151 0.1168099 -0.0452753 -0.0819616 -0.0520334 -0.0736416 0.1427112 -0.0716151 -0.0334625 -0.0368246 0.078513 -0.0247061 -0.0170832 -0.0014052 -0.123408 -0.3144117 0.0398333 -0.0035719 0.3745002 -0.0908607 -0.1070492 -0.0455894 -0.0397522 -0.1655248 -0.3899114 0.0543192 0.0179705 -0.2316835 0.0760622 -0.0203384 0.1115659 -0.0671799 -0.1625996 1.4512062 -0.2493177 -0.2154894 -0.2917252 0.1347871 0.0472489 -0.2291971 0.0426412 0.1216884 0.015311 -0.0484456 -0.0443305 0.0013146 -0.0806626 0.01407 -0.0388232 0.0067199 -0.0169223 0.0709654 0.0858138 -0.000002 0.0632083 -0.0482141 0.0397622 -0.0138471 0.0297091 0.1302222 0.0739089 -0.0660926 0.0502636 -0.0654866 0.0552681 0.0326546 0.0421163 0.0159301 0.1211388 0.0858904 0.077886 0.0505357 0.0339061 0.3645006 0.1627816 0.0609854 0.0710297 0.2282319 0.2824893 0.0933587 0.0645868 0.0963613 0.1382873 0.1057594 -0.0059833 0.0390189 0.2465425 -0.0610441 -0.0875146 0.0704405 -0.0749481 0.0204151 0.0586231 0.075385 0.0639839 0.1408575 0.067041 0.0502661 0.0047547 0.0638283 -0.0209679 0.0376555 0.0047695 0.0336329 0.1581499 0.3553275 0.0442095 0.0163549 0.056001 0.1299268 -0.0226913 0.0379312 -0.0590273 0.2983297 0.2059463 -0.097154 -0.0705677 -0.0743589 0.2544188 -0.0914182 -0.0428286 -0.0890319 0.3360041 0.4046487 -0.0418534 0.0127881 -0.0855611 0.0969092 0.0977275 0.0176234 0.0873755 0.3533215 unknown
polarizability: 160.9315663|-2.3050099|112.8820989|-9.0819849|-2.0335433|89.3291646 unknown
InChI: InChI=1S/C7H10NO4P/c8-7(13(10,11)12)5-1-3-6(9)4-2-5/h1-4,7,9-11H,8H2
charge 0 multiplicity 1
23 atoms
P  -2.417295 -0.367794 -0.377279
O  -2.398476 0.102139 -2.066673
O  -3.87499 0.403786 0.190389
O  -2.377077 -1.956003 -0.174598
O  4.28554 -0.636925 -0.391103
N  -1.480812 0.905944 1.963352
C  -1.188391 0.850465 0.556042
C  0.244304 0.456392 0.256509
C  1.160883 1.423877 -0.218247
C  0.706737 -0.866358 0.498854
C  2.512599 1.091225 -0.446797
C  2.053873 -1.209731 0.279652
C  2.957107 -0.228682 -0.191368
H  -1.443139 1.810583 0.076324
H  0.818743 2.44762 -0.407392
H  0.004506 -1.641282 0.829685
H  -2.42551 1.200967 2.219973
H  -1.080568 0.166394 2.543064
H  3.210804 1.852747 -0.817448
H  2.420079 -2.225508 0.453916
H  -2.205639 -0.660631 -2.670639
H  -4.720365 -0.030294 -0.086675
H  4.841188 0.110768 -0.724541
