program: Gaussian 09
title: 000012664
version: EM64L-G09RevD.01
frameworkgroup: C1[X(C3F3N3)]
method: RPBEPBE
basis: SDD
operation: Freq
keyword: #p
keyword: freq=noraman
keyword: PBEPBE/SDD
title: #p freq=noraman PBEPBE/SDD
converged: YES YES YES YES
title: Mulliken charges:
elementType: F F F N N N C C C
charge: -0.106175 -0.106179 -0.106219 -0.007778 -0.007714 -0.007728 0.113905 0.113964 0.113923
chargesum: 0.00000
title: Mulliken charges with hydrogens summed into heavy atoms:
polarizability: 6.24090828e+01 -2.45375694e-03 6.24071390e+01 -3.16134938e-04 -6.55127596e-04 2.24803444e+01
1716.lowfreq: -9.8976 -9.5752 -4.3053 0.0001 0.0008 0.0010 194.4281 194.6134 204.1420
frequency: 194.4278 194.6129 204.1420 338.9890 339.3292 534.2823 534.4609 587.8092 596.3392 689.8566 690.0360 779.3466 880.2617 984.3997 984.5857 1224.3326 1309.7019 1310.6628 1407.9325 1476.5563 1477.1860
redmass: 14.7436 14.7435 16.0460 17.8220 17.8223 15.0367 15.0370 17.8689 14.0410 12.3912 12.3911 12.7551 14.0031 14.6600 14.6602 12.9348 12.5932 12.5910 12.4990 12.8432 12.8440
irintensity: 0.0018 0.0015 5.7728 1.4951 1.5074 0.2592 0.2564 0.0000 0.0000 0.0000 0.0001 24.4317 0.0001 94.8840 94.5628 0.0134 175.6336 174.7309 0.0016 513.2262 513.7584
temp: 298.150 k
press: 1.00000 atm
elementType: 9 9 9 7 7 7 6 6 6
symmnumber: 1
zpe: 100123.0 jmol-1
zpe.correction: 0.038135 hartree
zpe.thermalcorrener: 0.044645 hartree
zpe.thermalcorrenthalpy: 0.045589 hartree
zpe.thermalcorrgfe: 0.006650 hartree
zpe.sumelectzpe: -577.423526 hartree
zpe.sumelectthermal: -577.417016 hartree
zpe.sumelectthermalent: -577.416072 hartree
zpe.sumelectthermalfe: -577.455011 hartree
dipole: -0.0001 -0.0004 0.0001
dipole: 0.0005
quadrupole: -56.4093 -56.4088 -45.1202
quadrupole: -0.0002 -0.0009 -0.0006
quadrupole: -3.7632 -3.7627 7.5259 -0.0002 -0.0009 -0.0006
hfenergy: -577.4616607 hartree
pointgroup: C01 [X(C3F3N3)]
dipole: -0.0001158 0.0001235 0.0000579 debye
dipolederiv: -0.7927569 -0.3814505 0.0000085 -0.3814841 -0.4615881 0.0000062 0.0001191 0.0000338 -0.1737186 -0.2139602 0.047135 0.0000021 0.0473044 -1.0402109 -0.0000287 -0.0000187 0.0003584 -0.1736869 -0.874556 0.3341767 -0.0000055 0.3340857 -0.3796957 0.0000038 -0.0001316 0.0000267 -0.1737092 -0.5996922 -0.2806056 0.0000991 -0.2806873 -1.0153371 0.0000093 -0.0000531 -0.0000057 -0.1277006 -1.1545957 -0.0397251 0.0000112 -0.0396285 -0.4606633 -0.000097 -0.0000013 0.0000743 -0.127906 -0.6685625 0.3203672 -0.0000853 0.3202887 -0.9467087 0.0000009 0.0000584 0.0000005 -0.1277367 1.5848559 0.3459279 -0.000066 0.34583 1.2845199 0.000048 -0.000156 -0.0000492 0.3016156 1.0601391 -0.0427151 -0.0000144 -0.04287 1.8090971 0.0000125 0.0000102 -0.0003879 0.3013681 1.6591286 -0.3031107 0.0000502 -0.3028387 1.2105868 0.0000451 0.000173 -0.0000509 0.3014742 unknown
polarizability: 62.4100574|0.0017823|62.4061644|-0.0003601|0.000632|22.4803444 unknown
InChI: InChI=1S/C3F3N3/c4-1-7-2(5)9-3(6)8-1
charge 0 multiplicity 1
9 atoms
F  -2.229531 -1.462587 0.000071
F  -0.151554 2.662126 -0.000133
F  2.38135 -1.199695 0.000058
N  -1.250826 0.630067 0.000021
N  0.079669 -1.39807 -0.000069
N  1.170909 0.768106 -0.000019
C  -1.085054 -0.711703 -0.000089
C  -0.073929 1.295501 0.000279
C  1.158866 -0.583745 -0.000119
