program: Gaussian 09
title: 000175991
version: EM64L-G09RevD.01
frameworkgroup: C1[X(C16H22N2O3)]
method: RPBEPBE
basis: SDD
operation: Freq
keyword: #p
keyword: freq=noraman
keyword: PBEPBE/SDD
title: #p freq=noraman PBEPBE/SDD
converged: YES YES NO NO
title: Mulliken charges:
elementType: O O O N N C C C C C C C C C C C C C C C C H H H H H H H H H H H H H H H H H H H H H H
charge: -0.251125 -0.267251 -0.273646 -0.125104 -0.383987 -0.370270 -0.361841 -0.304572 -0.307186 0.139727 0.198861 0.149035 -0.332598 -0.397818 -0.355450 -0.361075 0.134118 -0.364316 -0.230352 -0.249406 -0.683022 0.231980 0.226703 0.262811 0.220281 0.210448 0.227595 0.227809 0.217564 0.217052 0.201623 0.259076 0.208071 0.194380 0.192145 0.259201 0.303914 0.222871 0.236942 0.233808 0.212110 0.216676 0.214217
chargesum: 0.00000
title: Mulliken charges with hydrogens summed into heavy atoms:
elementType: O O O N N C C C C C C C C C C C C C C C C
charge: -0.251125 -0.267251 -0.273646 -0.125104 -0.080073 0.088413 0.121251 0.133470 0.138188 0.139727 0.198861 0.149035 0.086077 0.069329 0.031075 -0.101874 0.134118 -0.141445 0.006591 -0.015598 -0.040019
polarizability: 2.22278275e+02 -4.93101302e+00 2.18240087e+02 -9.42578072e+00 1.46581045e+01 1.47671233e+02
1716.lowfreq: -9.9011 -4.7261 -0.0008 -0.0007 -0.0004 6.7009 11.7706 26.0712 32.5571
frequency: 9.0525 25.1986 32.3548 39.5397 65.4354 80.9661 83.2513 93.5591 103.8059 130.9646 151.2000 192.6443 197.6867 220.7561 243.3412 258.3354 282.7693 293.8431 306.6111 325.9043 342.4360 389.9493 402.6313 409.9956 421.6275 462.7893 494.4344 526.9676 544.0384 556.8440 590.0980 627.3688 649.8291 679.7859 696.6418 701.4142 735.4522 771.1261 776.3364 783.9130 792.1555 832.6774 844.1988 849.7765 867.9109 885.2404 911.6744 938.2967 955.3444 970.9587 992.9041 996.9266 1010.0714 1027.5244 1046.3181 1048.7919 1062.1475 1068.6952 1091.8490 1111.3248 1119.3025 1132.4148 1148.2974 1156.9510 1181.1989 1183.4439 1195.9989 1226.1376 1238.9596 1253.7671 1262.8060 1271.0902 1276.4428 1280.0515 1286.9307 1311.3488 1324.8087 1342.9162 1347.4674 1351.0234 1364.4848 1367.1294 1371.6440 1391.8851 1414.4480 1430.1113 1443.8126 1446.8256 1450.9647 1454.7555 1457.7493 1460.6136 1467.3294 1474.2916 1478.5969 1486.6416 1495.1667 1562.3183 1565.3539 1588.7735 1605.9231 2957.8157 2970.9364 2975.0350 2979.2529 2980.5948 2983.2064 2989.5164 2992.1314 3003.1185 3044.8061 3071.7506 3075.3600 3076.1166 3077.9840 3081.6088 3084.5531 3092.0352 3124.0034 3137.6516 3151.4339 3167.9923 3565.8952
redmass: 3.6913 5.5994 3.7408 3.9376 6.1669 2.3501 2.7145 3.7360 3.6602 5.5100 4.1675 3.1037 3.5385 3.1245 1.1881 3.9268 2.6828 3.0435 3.3492 5.3870 4.7086 3.2921 2.1199 3.2325 4.3466 2.9452 3.9243 2.3571 3.2100 1.3471 2.8078 3.7123 5.0517 5.1221 3.5819 5.5917 1.2713 1.9249 2.0816 2.9272 4.2221 1.6874 1.7378 2.4230 2.6019 1.6692 2.5708 1.7102 1.4067 1.6570 1.4079 2.6858 2.3461 3.9330 2.9036 2.5219 2.5366 2.5295 2.4198 2.2023 1.9973 1.9960 1.9089 2.3523 1.0861 2.7006 1.0909 1.3344 1.7831 1.5321 1.7008 1.4576 1.3934 1.4834 1.1168 1.2459 1.2404 1.2144 1.4932 1.3556 1.3667 1.4432 5.0033 1.2108 2.3335 2.3354 1.1709 1.0915 1.0836 1.1210 1.1378 1.0896 1.9987 1.0673 1.0426 1.0804 2.1057 8.6035 6.7069 6.9773 6.1625 1.0588 1.0681 1.0365 1.0666 1.0610 1.0610 1.0629 1.0656 1.0980 1.1002 1.1003 1.0998 1.1001 1.0982 1.0982 1.0962 1.1021 1.0865 1.0883 1.0941 1.1009 1.0772
irintensity: 0.3896 1.2526 0.1820 0.3205 4.4262 0.3382 1.2118 4.0978 0.8145 2.5304 2.2131 7.3487 2.0787 2.6857 0.9601 2.0744 5.1177 5.1742 1.9069 18.8326 7.4974 6.9066 1.2899 6.3046 1.7124 0.3430 2.4627 25.9914 6.5982 99.5658 6.7945 5.4030 3.6587 12.3740 18.6593 18.1050 18.8391 46.4995 12.9035 10.0442 13.7307 0.5811 1.2334 1.3871 3.1985 1.4788 4.0341 10.7828 0.8191 14.3249 4.1955 45.2509 34.2529 0.6198 40.1459 19.1083 4.7710 14.9124 4.0609 10.1010 3.4500 2.2999 20.2730 5.2912 0.3612 0.0382 0.8489 2.7494 36.8499 34.1391 72.3352 70.5471 70.9640 23.3795 1.1774 35.4184 1.3199 6.6421 0.6795 4.2044 2.3688 0.2514 6.1580 11.0125 67.0537 48.8501 25.8622 26.0698 7.9475 10.6136 14.0850 3.7456 73.9745 3.1586 11.8267 13.5821 178.0461 276.0091 86.6026 63.8983 23.8409 28.4152 36.0181 27.7236 26.1520 48.5254 39.9306 76.4909 39.8238 6.4646 51.5441 77.0365 34.6301 23.3086 39.2686 18.4446 11.6155 39.6376 7.0726 4.9313 17.3989 24.5462 13.3320
temp: 298.150 k
press: 1.00000 atm
elementType: 8 8 8 7 7 6 6 6 6 6 6 6 6 6 6 6 6 6 6 6 6 1 1 1 1 1 1 1 1 1 1 1 1 1 1 1 1 1 1 1 1 1 1
symmnumber: 1
zpe: 940615.7 jmol-1
zpe.correction: 0.358262 hartree
zpe.thermalcorrener: 0.379184 hartree
zpe.thermalcorrenthalpy: 0.380129 hartree
zpe.thermalcorrgfe: 0.305525 hartree
zpe.sumelectzpe: -956.493763 hartree
zpe.sumelectthermal: -956.472840 hartree
zpe.sumelectthermalent: -956.471896 hartree
zpe.sumelectthermalfe: -956.546500 hartree
dipole: -3.1236 -4.1069 -3.9363
dipole: 6.4898
quadrupole: -122.6190 -114.9863 -131.1214
quadrupole: 4.7929 -13.8089 3.3960
quadrupole: 0.2899 7.9226 -8.2125 4.7929 -13.8089 3.3960
hfenergy: -956.8520248 hartree
pointgroup: C01 [X(C16H22N2O3)]
dipole: -0.6971063 1.6604466 1.810058 debye
polarizability: 225.102364|1.6635647|211.4733948|11.9553277|20.3590238|151.6138357 unknown
InChI: InChI=1S/C16H22N2O3/c1-2-3-8-17-15(19)13-6-4-5-7-14(13)16(20)18-9-11-21-12-10-18/h4-7,17H,2-3,8-12H2,1H3
charge 0 multiplicity 1
43 atoms
O  -1.664644 -3.348038 0.280918
O  2.497633 -1.574442 -1.62391
O  -0.345216 0.190575 -1.609434
N  0.933482 -2.14703 0.004424
N  -1.073105 2.056505 -0.432941
C  0.116653 -1.882365 1.204352
C  0.637245 -3.440809 -0.649652
C  -1.385045 -2.027511 0.8678
C  -0.86997 -3.52587 -0.954699
C  1.810323 -1.260721 -0.600655
C  2.066496 0.081583 0.068886
C  1.208857 1.217279 -0.032035
C  -3.522754 1.400585 -0.40287
C  -2.369059 2.126603 -1.134419
C  -3.863334 1.986093 0.986117
C  3.318517 0.216265 0.71969
C  -0.114218 1.105152 -0.753833
C  1.648729 2.460745 0.49936
C  3.726736 1.44635 1.275381
C  2.890153 2.579385 1.155965
C  -5.031265 1.242646 1.669838
H  0.380357 -2.624637 1.985442
H  0.333637 -0.87574 1.597926
H  1.240376 -3.498586 -1.571169
H  0.928972 -4.266842 0.029003
H  -1.999455 -1.975016 1.782548
H  -1.686275 -1.232456 0.156169
H  -1.146968 -2.746573 -1.693811
H  -1.143372 -4.523571 -1.334694
H  -3.267521 0.327556 -0.306102
H  -4.421054 1.452083 -1.051429
H  -2.216326 1.669912 -2.127455
H  -2.626424 3.19434 -1.27755
H  -2.96812 1.936676 1.639731
H  -4.119478 3.060864 0.879526
H  3.980633 -0.654485 0.769213
H  -0.901984 2.699314 0.340224
H  1.042167 3.362981 0.358319
H  4.697794 1.52602 1.775533
H  3.21115 3.549107 1.551004
H  -5.949442 1.297997 1.055529
H  -5.261099 1.672895 2.661628
H  -4.789283 0.172479 1.811431
