program: Gaussian 09
title: 000012662
version: EM64L-G09RevD.01
frameworkgroup: C1[X(C7H8O2)]
method: RPBEPBE
basis: SDD
operation: Freq
keyword: #p
keyword: freq=noraman
keyword: PBEPBE/SDD
title: #p freq=noraman PBEPBE/SDD
converged: NO YES NO YES
title: Mulliken charges:
elementType: O O C C C C C C C H H H H H H H H
charge: -0.243126 -0.209058 0.489414 0.366106 -0.465179 -0.474793 -0.793698 -0.761181 0.140901 0.244838 0.255380 0.238672 0.235575 0.238667 0.253247 0.230985 0.253251
chargesum: 0.00000
title: Mulliken charges with hydrogens summed into heavy atoms:
elementType: O O C C C C C C C
charge: -0.243126 -0.209058 0.489414 0.366106 -0.220341 -0.219413 -0.080784 -0.023699 0.140901
polarizability: 9.86544562e+01 -4.26704679e-01 1.06495154e+02 3.72527582e-03 -8.02502890e-03 4.40767284e+01
1716.lowfreq: -15.3915 -9.6034 -0.0007 0.0000 0.0005 11.5321 111.0706 122.6016 152.0783
frequency: 111.0398 122.5963 152.0779 178.1809 204.0743 261.0090 307.8034 451.4196 497.7624 510.3536 521.7313 570.6167 608.4383 694.8977 732.6545 837.8048 867.2654 920.7955 960.1755 990.1576 1023.6040 1047.4239 1050.7961 1107.5598 1154.5573 1243.2962 1314.3022 1392.4079 1403.3013 1407.1318 1450.2007 1462.9071 1464.0576 1469.8118 1567.4653 1624.6651 1707.6322 2981.1690 2994.1766 3058.7995 3076.4708 3101.9551 3113.9212 3168.7620 3172.4037
redmass: 1.1133 1.1501 5.1716 2.3400 3.4180 2.5747 3.8361 6.7689 4.2864 3.3466 5.4735 6.3339 3.6471 3.7859 5.7844 1.2601 1.3765 5.6159 3.3242 1.8266 1.4892 1.5887 1.5403 4.2666 1.7413 1.7691 2.1316 1.3337 1.4146 1.9472 1.0435 1.1100 1.0453 1.1420 6.1450 6.5078 10.4172 1.0378 1.0370 1.0968 1.0974 1.0991 1.0998 1.0921 1.0930
irintensity: 0.0521 1.7844 0.0985 1.8121 3.0346 0.4798 1.0494 0.7860 1.7201 3.5394 5.5291 3.1774 4.7145 0.1851 62.7466 42.6673 8.3102 24.1591 1.5515 12.3599 1.0784 16.4916 11.2519 13.5661 10.8141 9.6989 15.4453 31.0925 33.4974 0.3173 15.9053 30.1387 15.0263 20.6173 106.6504 125.3021 526.1764 14.5190 11.0147 14.4635 8.2629 18.4151 13.4703 6.4666 0.6032
temp: 298.150 k
press: 1.00000 atm
elementType: 8 8 6 6 6 6 6 6 6 1 1 1 1 1 1 1 1
symmnumber: 1
zpe: 347273.7 jmol-1
zpe.correction: 0.132270 hartree
zpe.thermalcorrener: 0.141118 hartree
zpe.thermalcorrenthalpy: 0.142062 hartree
zpe.thermalcorrgfe: 0.098680 hartree
zpe.sumelectzpe: -421.323336 hartree
zpe.sumelectthermal: -421.314487 hartree
zpe.sumelectthermalent: -421.313543 hartree
zpe.sumelectthermalfe: -421.356926 hartree
dipole: 2.0362 -5.4614 0.0014
dipole: 5.8286
quadrupole: -45.9565 -59.6243 -53.7885
quadrupole: 5.8814 -0.0010 0.0032
quadrupole: 7.1666 -6.5012 -0.6654 5.8814 -0.0010 0.0032
hfenergy: -421.4556054 hartree
pointgroup: C01 [X(C7H8O2)]
dipole: -1.0125542 2.0574999 0.0005544 debye
dipolederiv: -0.4827883 -0.4209665 -0.0000929 0.1779805 -1.0473947 -0.000203 0.0001192 0.0001633 -0.2010515 -0.523113 0.4525299 -0.0000284 0.2671786 -1.3672467 0.0000866 0.0002114 -0.0007082 -0.3418678 0.6543301 0.0483127 -0.0000172 0.0488761 0.7257585 -0.0000325 -0.0000487 0.0000992 0.0511661 0.8820387 0.2760558 -0.0000818 -0.1975088 0.5296728 0.0000891 -0.0000517 0.0000206 0.1081084 -0.8066555 -0.4185564 0.0000393 -0.0680736 -0.1908605 0.0000443 0.0000407 0.0000187 -0.2585791 -0.3656428 0.5992621 0.0000791 0.1430429 -0.5910209 0.0000011 -0.000032 -0.0000341 -0.2096121 -0.1965845 0.0793632 0.0000097 0.1670915 -0.0076501 -0.0000209 0.0001065 0.0000084 0.0432558 -0.2199946 -0.2003826 0.0000188 -0.0750773 -0.0451417 -0.0000049 -0.0000313 0.000004 0.0301094 0.7657634 -0.4592965 0.0000677 -0.2919476 1.9519429 0.0000629 -0.0001908 0.0004482 0.2714939 0.0927957 0.0351464 0.0000087 0.0157044 -0.0660137 -0.0000256 0.0000039 -0.0000336 0.1721918 -0.001205 -0.0633081 -0.0000153 -0.0620837 0.0314203 0. -0.0000559 0.0000006 0.1740025 0.0476818 0.0268719 0.0054803 0.0248931 0.0398091 -0.1107335 0.0562308 -0.1122497 -0.0258258 -0.0084515 -0.0484763 -0.0000113 -0.1535096 -0.0490616 -0.000027 -0.0000368 -0.0000196 0.1135353 0.0477036 0.0268729 -0.0054556 0.0249028 0.0397279 0.1107633 -0.0562523 0.1122913 -0.0257918 0.0299386 -0.0171009 -0.0812716 -0.0175688 0.0765667 0.0489165 -0.1160227 0.0096587 -0.010216 0.0541847 0.10078 0.0000109 0.0136717 -0.1070978 -0.0000171 0.0000012 -0.0000276 0.1193426 0.0299987 -0.0171075 0.0812597 -0.0175723 0.0765894 -0.0488993 0.1160086 -0.0096403 -0.0102618 unknown
polarizability: 98.8184728|-1.2004915|106.3311376|-0.0045113|0.007611|44.0767284 unknown
InChI: InChI=1S/C7H8O2/c1-5-3-6(2)9-7(8)4-5/h3-4H,1-2H3
charge 0 multiplicity 1
17 atoms
O  1.350503 -0.329379 0.000054
O  0.817818 -2.590988 -0.00044
C  -1.392236 0.344781 0.000318
C  0.968674 1.003664 0.000184
C  -0.364531 1.361923 0.000369
C  -1.02594 -0.995514 0.000214
C  -2.845334 0.765671 0.000295
C  2.146673 1.934699 0.000125
C  0.354663 -1.436228 0.000417
H  -0.632067 2.421634 0.000483
H  -1.777045 -1.790257 0.000104
H  -3.073764 1.383814 0.888958
H  -3.523798 -0.102626 0.000136
H  -3.073639 1.384044 -0.888237
H  2.779174 1.756201 0.888437
H  1.818461 2.986146 0.000226
H  2.778988 1.756316 -0.888343
