program: Gaussian 09
title: 000175846
version: EM64L-G09RevD.01
frameworkgroup: C1[X(C11H11N3O2)]
method: RPBEPBE
basis: SDD
operation: Freq
keyword: #p
keyword: freq=noraman
keyword: PBEPBE/SDD
title: #p freq=noraman PBEPBE/SDD
converged: YES YES NO NO
title: Mulliken charges:
elementType: O O N N N C C C C C C C C C C C H H H H H H H H H H H
charge: -0.241448 -0.183566 -0.180303 -0.014091 0.073602 -0.549731 0.353773 0.499526 -0.045107 -0.212241 -0.741902 -0.431328 -0.367999 -0.212419 -0.218726 -0.237829 0.239035 0.245679 0.268058 0.265204 0.283322 0.221852 0.231974 0.248680 0.233739 0.235785 0.236459
chargesum: 0.00000
title: Mulliken charges with hydrogens summed into heavy atoms:
elementType: O O N N N C C C C C C C C C C C
charge: -0.241448 -0.183566 -0.180303 -0.014091 0.073602 -0.065017 0.353773 0.499526 -0.045107 0.055817 0.028476 -0.199354 -0.119318 0.021320 0.017059 -0.001369
polarizability: 1.87348471e+02 -1.20660043e+01 1.23652318e+02 -1.75430487e+01 3.05987551e+00 1.18381836e+02
1716.lowfreq: -10.8574 -3.1371 0.0004 0.0005 0.0010 8.1600 25.9219 33.8003 40.4889
frequency: 25.4948 33.7338 40.4685 56.6960 65.5627 125.3239 172.5052 223.5772 261.3045 266.6018 305.3178 313.0257 365.7180 402.2740 423.8471 461.7319 543.6477 572.8680 613.8023 627.4466 641.0782 672.8646 702.5501 726.4375 729.6073 755.4551 779.6024 788.6855 805.4292 854.2607 907.1852 920.2724 966.4798 979.8239 990.2817 1001.9478 1026.8140 1038.5979 1068.6569 1087.4530 1133.3937 1171.1742 1175.7641 1190.8165 1192.2854 1214.7686 1256.3885 1295.3244 1307.6809 1333.0756 1348.5268 1360.5394 1377.5331 1388.2027 1409.9988 1438.7336 1443.8510 1445.6763 1474.7673 1483.9653 1487.6048 1537.4863 1597.2094 1615.3750 2992.9941 2998.8004 3049.6633 3073.1374 3115.9788 3121.8893 3127.3690 3139.5242 3151.2592 3168.7358 3234.7139
redmass: 3.7770 6.0239 6.8638 3.6417 1.2905 5.6923 5.1826 3.9451 4.6317 3.8269 2.6232 4.4823 4.2917 2.8073 5.8470 3.4241 4.7003 5.0918 6.1146 8.4488 3.9383 5.3193 2.3451 9.8289 1.8881 4.0090 2.0302 2.4175 3.9443 1.2486 1.4407 2.3669 1.9745 1.3903 6.2512 1.3303 2.2371 1.4739 2.3432 1.5903 2.8228 2.4147 1.0666 1.4168 2.0666 2.8005 2.0466 3.0310 2.0000 2.5438 1.5467 5.8893 5.0256 4.7169 1.2316 2.0772 1.1589 2.0895 1.1813 1.5200 1.8667 7.4715 6.1016 5.9936 1.0400 1.0597 1.1028 1.0949 1.0886 1.0981 1.0869 1.0906 1.0958 1.1014 1.0990
irintensity: 0.2551 1.4331 1.1087 1.4915 0.5068 0.3925 1.5808 2.1649 0.2917 1.0184 1.2622 2.0581 1.1635 0.2134 0.5002 9.3954 2.3182 2.7722 0.2408 4.7506 13.3561 2.6313 25.2759 2.6879 47.5064 64.1613 22.1068 27.5408 2.7197 0.1777 0.4178 18.7963 10.2162 0.0377 1.0277 0.4690 6.7260 10.8141 3.2974 11.5657 24.8618 18.5339 1.1130 41.2935 53.3720 44.1172 22.2451 35.8770 64.1325 30.6327 48.7909 150.9268 30.5502 0.6752 8.0006 63.3425 8.7245 10.7160 40.6720 5.1216 24.2350 44.7214 1.1194 3.9288 10.8935 22.3992 7.0108 14.2310 9.1562 4.5639 3.2808 6.4028 29.2407 18.7081 0.4901
temp: 298.150 k
press: 1.00000 atm
elementType: 8 8 7 7 7 6 6 6 6 6 6 6 6 6 6 6 1 1 1 1 1 1 1 1 1 1 1
symmnumber: 1
zpe: 539507.7 jmol-1
zpe.correction: 0.205488 hartree
zpe.thermalcorrener: 0.219581 hartree
zpe.thermalcorrenthalpy: 0.220526 hartree
zpe.thermalcorrgfe: 0.161799 hartree
zpe.sumelectzpe: -739.234515 hartree
zpe.sumelectthermal: -739.220421 hartree
zpe.sumelectthermalent: -739.219477 hartree
zpe.sumelectthermalfe: -739.278203 hartree
dipole: 8.9236 1.5714 -2.7324
dipole: 9.4640
quadrupole: -117.2167 -93.3715 -85.6388
quadrupole: -5.0909 5.6586 -2.7776
quadrupole: -18.4744 5.3708 13.1035 -5.0909 5.6586 -2.7776
hfenergy: -739.4400027 hartree
pointgroup: C01 [X(C11H11N3O2)]
dipole: -3.4112426 0.5886106 -1.371391 debye
polarizability: 180.198371|-27.6006575|131.2316776|9.9660301|-0.6211577|117.9525758 unknown
InChI: InChI=1S/C11H11N3O2/c1-9-11(14(15)16)12-8-13(9)7-10-5-3-2-4-6-10/h2-6,8H,7H2,1H3
charge 0 multiplicity 1
27 atoms
O  3.499153 1.157858 1.088443
O  4.431675 -0.926242 0.95532
N  0.389908 -0.640405 -1.090284
N  2.169314 -1.875881 -0.401164
N  3.484382 -0.091638 0.713016
C  -0.920485 -0.342479 -1.701302
C  1.231191 0.262913 -0.431208
C  -2.006546 0.027106 -0.691733
C  2.317948 -0.541868 -0.02086
C  0.99574 -1.906679 -1.043397
C  0.928107 1.719592 -0.270911
C  -2.977792 0.998752 -1.034139
C  -2.084537 -0.61629 0.568138
C  -4.020733 1.318056 -0.135359
C  -3.123234 -0.293533 1.469164
C  -4.095544 0.672523 1.119955
H  -1.213553 -1.251142 -2.26066
H  -0.801659 0.465915 -2.445883
H  0.541384 -2.789994 -1.486844
H  0.434339 1.915978 0.699288
H  1.865345 2.295752 -0.271436
H  0.259987 2.090226 -1.067045
H  -2.921157 1.509611 -2.003932
H  -1.332861 -1.363038 0.85008
H  -4.766093 2.072177 -0.41057
H  -3.173055 -0.793465 2.442641
H  -4.899723 0.922194 1.820484
