program: Gaussian 09
title: 000175840
version: EM64L-G09RevD.01
frameworkgroup: C1[X(C7H17O2PS2)]
method: RPBEPBE
basis: SDD
operation: Freq
keyword: #p
keyword: freq=noraman
keyword: PBEPBE/SDD
title: #p freq=noraman PBEPBE/SDD
converged: YES YES NO NO
title: Mulliken charges:
elementType: S S P O O C C C C C C C H H H H H H H H H H H H H H H H H
charge: -0.041733 -0.031492 0.761472 -0.462621 -0.596053 -0.352019 -0.338663 -0.619171 -0.648882 -0.624494 -0.648483 -0.487223 0.311576 0.281927 0.217826 0.259211 0.214406 0.222526 0.241538 0.222748 0.207862 0.281263 0.221695 0.223697 0.233383 0.228468 0.241125 0.234284 0.245829
chargesum: 0.00000
title: Mulliken charges with hydrogens summed into heavy atoms:
elementType: S S P O O C C C C C C C
charge: -0.041733 -0.031492 0.761472 -0.462621 -0.596053 -0.040443 -0.056736 0.072272 0.037930 0.086325 0.037065 0.234014
polarizability: 2.24046985e+02 3.54975591e+00 1.24354725e+02 5.13536613e-01 -2.28809897e+00 1.26724641e+02
1716.lowfreq: -22.8148 -14.2084 -4.6986 -0.0020 -0.0015 0.0004 10.0475 25.3951 33.6171
frequency: -7.6149 23.0869 33.1937 46.3019 61.8151 87.8827 110.4283 115.3572 129.9577 154.5865 193.8537 205.4074 210.5836 224.9870 232.8877 248.6392 255.1190 283.5649 317.4456 327.2553 334.5461 345.1168 392.9645 405.7017 421.0516 449.6794 546.4481 553.3961 611.5402 879.5512 883.9034 928.4089 931.4274 949.0351 950.8634 960.9480 1009.7992 1057.1269 1063.8715 1114.7660 1120.4219 1132.4647 1137.6228 1163.2081 1165.0830 1249.8533 1265.8891 1314.5527 1315.3712 1382.4008 1382.5291 1399.1483 1402.7260 1418.4041 1450.3161 1458.0438 1458.1759 1460.9841 1464.3529 1472.6452 1472.9109 1474.3630 1480.5751 1487.5484 2971.9205 2974.0001 2976.3761 2980.5823 2982.5194 3037.0756 3043.2546 3069.2165 3069.3070 3070.0004 3076.5719 3077.4582 3092.4719 3093.5691 3098.4075 3099.3497 3122.5270
redmass: 3.8600 4.1548 2.7178 3.2766 4.4504 1.7234 2.7033 3.2323 3.3458 4.4684 3.4971 1.1490 1.1041 2.3514 1.6527 1.2726 2.3883 4.7504 2.9362 3.5294 3.7305 4.7627 3.3252 2.5591 5.0464 25.3302 3.6679 3.7651 10.3342 2.7397 2.7294 1.1530 1.1456 1.3955 1.4135 10.8827 14.8497 1.3501 1.3827 1.2489 1.2981 2.3894 2.3686 1.8735 1.8445 1.2181 1.1896 1.4132 1.4169 1.2027 1.2054 1.1997 1.1958 1.1179 1.0483 1.0469 1.0467 1.0456 1.0462 1.0468 1.0489 1.0474 1.0477 1.0460 1.0305 1.0373 1.0366 1.0357 1.0359 1.0873 1.0880 1.0976 1.1002 1.1019 1.0978 1.0974 1.1009 1.1009 1.1010 1.1002 1.1017
irintensity: 1.1857 1.8241 0.2928 0.0079 1.8865 3.1719 3.0861 1.1798 9.0822 2.7679 0.7811 0.0457 0.5945 3.8552 1.2342 0.8313 2.3335 5.6651 1.0405 1.9348 4.6625 1.2086 7.4085 1.2172 5.1153 279.7508 18.9299 3.8985 98.1087 2.3842 2.7792 4.9111 2.3411 0.5500 0.4379 99.4650 60.6035 87.4545 27.5170 0.0100 0.4428 4.0934 2.5678 48.1113 23.9767 37.1371 27.2436 3.6393 3.9781 23.0964 26.2435 19.1205 20.9626 8.8269 9.8878 10.9222 8.4998 1.5696 4.3016 21.0269 13.9830 1.9688 13.3776 18.0957 44.1206 28.1190 21.9672 40.9517 31.7626 1.1388 1.7017 7.7857 16.9967 9.9931 36.9223 37.8924 14.5380 10.1837 22.7472 29.0841 9.3548
temp: 298.150 k
press: 1.00000 atm
elementType: 16 16 15 8 8 6 6 6 6 6 6 6 1 1 1 1 1 1 1 1 1 1 1 1 1 1 1 1 1
symmnumber: 1
zpe: 612587.9 jmol-1
zpe.correction: 0.233322 hartree
zpe.thermalcorrener: 0.251120 hartree
zpe.thermalcorrenthalpy: 0.252064 hartree
zpe.thermalcorrgfe: 0.186224 hartree
zpe.sumelectzpe: -1563.729782 hartree
zpe.sumelectthermal: -1563.711984 hartree
zpe.sumelectthermalent: -1563.711040 hartree
zpe.sumelectthermalfe: -1563.776880 hartree
dipole: 0.3544 1.9524 -0.8855
dipole: 2.1729
quadrupole: -77.2502 -93.1939 -106.8612
quadrupole: 2.4781 0.3613 0.0344
quadrupole: 15.1849 -0.7588 -14.4261 2.4781 0.3613 0.0344
hfenergy: -1563.9631039 hartree
pointgroup: C01 [X(C7H17O2P1S2)]
dipole: -0.1367183 0.6963058 0.4767715 debye
polarizability: 224.0401816|-3.6209165|123.6488989|-0.5983765|1.7655369|127.4372711 unknown
InChI: InChI=1S/2C3H7S.CH3O2P/c2*1-3(2)4;1-3-4-2/h2*3H,1-2H3;1H3
charge 0 multiplicity 1
29 atoms
S  1.844862 0.017597 1.254618
S  -1.696723 -0.331671 1.197288
P  0.059458 0.204595 -0.179493
O  -0.159161 1.906319 -0.529475
O  0.21378 -0.581789 -1.558443
C  3.119493 -0.514788 -0.109652
C  -3.127345 -0.076129 -0.093882
C  3.55137 0.697964 -0.945715
C  4.276518 -1.201174 0.635369
C  -3.131413 -1.213809 -1.125199
C  -4.421045 0.010699 0.734816
C  -0.173444 2.86519 0.593367
H  2.565633 -1.237008 -0.734707
H  -2.909637 0.89393 -0.575037
H  4.034609 1.464556 -0.313897
H  2.693304 1.15725 -1.466059
H  4.278943 0.373443 -1.715127
H  4.785904 -0.500757 1.321896
H  3.928265 -2.072323 1.216002
H  5.021596 -1.551484 -0.10389
H  -3.952816 -1.048275 -1.850019
H  -2.180669 -1.261532 -1.683072
H  -3.296902 -2.187663 -0.631047
H  -5.277408 0.16586 0.051341
H  -4.395462 0.846549 1.455218
H  -4.59987 -0.927335 1.291059
H  0.793598 2.851903 1.129363
H  -0.996348 2.637716 1.296948
H  -0.334591 3.845865 0.121231
