program: Gaussian 09
title: 000175755
version: EM64L-G09RevD.01
frameworkgroup: C1[X(C13H22O3)]
method: RPBEPBE
basis: SDD
operation: Freq
keyword: #pfreq=noraman
keyword: PBEPBE/SDD
title: #p freq=noraman PBEPBE/SDD
converged: YES YES NO NO
title: Mulliken charges:
elementType: O O O C C C C C C C C C C C C C H H H H H H H H H H H H H H H H H H H H H H
charge: -0.249504 -0.231632 -0.231741 0.146707 0.212209 -0.093484 -0.321382 -0.319989 -0.320485 -0.095026 -0.475845 -0.473951 -0.424642 -0.427004 -0.737974 -0.737900 0.243053 0.214705 0.214152 0.205150 0.214969 0.215577 0.205244 0.197891 0.224562 0.233426 0.234029 0.223458 0.201282 0.214020 0.213974 0.201171 0.214689 0.221065 0.226797 0.215067 0.221120 0.226240
chargesum: 0.00000
title: Mulliken charges with hydrogens summed into heavy atoms:
elementType: O O O C C C C C C C C C C C C C
charge: -0.249504 -0.231632 -0.231741 0.146707 0.212209 0.149569 0.107475 0.100131 0.100336 0.102865 -0.017857 -0.016464 -0.009340 -0.011860 -0.075423 -0.075473
polarizability: 1.78953519e+02 -3.77729889e-03 1.29859433e+02 5.22888273e-01 3.75653219e-03 1.18827901e+02
1716.lowfreq: -125.0926 -44.5805 -31.4836 -12.5485 -4.3895 -0.0008 -0.0006 -0.0003 16.5781
frequency: -125.0172 -44.4513 -27.7962 62.7746 79.4493 91.7180 159.3222 182.5572 209.5244 212.4309 223.2216 256.9872 293.7319 315.4324 330.6360 363.3760 420.1396 427.1537 451.0861 468.5429 508.5035 553.1219 554.6550 562.2856 618.4852 690.5607 717.4263 773.9878 816.2016 828.0886 853.7595 867.3230 870.5224 889.0571 909.8874 921.6535 925.0581 928.6149 929.8330 952.5495 954.9769 963.7289 974.4794 977.9154 981.8776 987.4364 1058.5200 1068.2758 1103.5924 1108.8088 1113.4217 1152.0381 1158.3113 1165.9325 1171.9517 1172.6430 1190.0446 1212.3529 1226.0964 1252.4832 1258.3776 1261.5230 1269.2742 1285.9427 1299.0397 1303.2763 1303.7465 1310.9970 1327.6104 1330.6198 1346.9455 1365.6376 1372.4516 1386.0271 1404.0432 1466.3298 1466.6313 1473.4458 1474.1187 1475.2986 1477.4974 1478.0263 1485.0837 1491.2389 1493.3129 1498.8025 2950.0543 2978.0766 2982.6584 2983.0242 2984.4452 2989.8629 2991.9212 3004.0908 3010.3267 3013.3787 3022.2758 3040.2805 3042.1143 3049.8056 3050.7402 3064.4189 3071.9856 3077.9134 3082.8065 3082.9100 3086.8581 3093.2390
redmass: 2.7161 1.6009 2.3377 3.4049 3.4396 3.3348 2.7305 2.2031 1.2794 1.1952 2.6299 3.5803 2.8606 2.4783 3.3370 2.6720 3.4165 3.5573 2.6277 4.3926 2.6491 7.4347 7.4894 2.6640 2.6592 5.4332 2.6939 1.5368 1.5920 3.9390 3.4198 5.2665 3.2922 3.0593 1.1925 1.3037 3.1202 5.4630 7.8267 1.4497 2.1080 1.6360 1.8268 1.5140 1.8324 4.0185 1.9438 2.5610 2.2716 2.7695 3.4116 1.5192 1.4377 1.1018 1.4741 1.3543 1.9448 1.5711 1.1897 1.9952 1.9647 1.7536 1.2958 1.2121 1.2949 1.5695 1.3898 1.4423 1.3520 1.2655 1.5099 1.5703 1.5676 1.2015 1.2015 1.0610 1.0768 1.0629 1.0785 1.0864 1.0525 1.0819 1.0649 1.0494 1.1014 1.0834 1.0835 1.0573 1.0582 1.0380 1.0393 1.0597 1.0554 1.0617 1.0805 1.0632 1.0671 1.0997 1.1068 1.1076 1.1063 1.1022 1.0996 1.0984 1.1015 1.1017 1.0985 1.1044
irintensity: 0.0067 0.0026 0.0091 0.3378 0.9705 0.9125 0.2158 1.3331 0.6353 0.2689 8.5330 2.7938 9.4120 1.6061 2.8970 2.4498 1.9265 0.8504 4.5964 0.1071 1.4960 0.4982 0.2756 0.1109 0.0174 8.5143 25.4662 1.1146 0.6338 30.6791 14.2293 130.6054 45.3646 36.6149 2.4429 0.7597 2.6042 20.8940 18.8024 2.8231 19.1281 4.5302 1.2611 3.1358 16.6138 125.0897 13.0824 7.0904 1.7133 44.0568 0.5562 2.8349 2.1470 0.1711 2.5965 21.1806 20.5537 3.6249 2.8645 60.7044 22.4609 0.7798 0.8899 15.1827 1.8193 37.0682 0.7603 1.4774 0.9230 0.5666 2.7974 1.6541 16.4993 22.2385 22.4756 2.0588 0.2006 8.2229 7.6137 7.7634 2.6039 11.2385 8.1537 15.4543 1.8361 8.8817 17.3554 22.0022 84.0426 38.4740 5.5883 26.9101 103.4647 75.1372 14.7948 33.7174 5.9944 13.7753 0.5764 51.7720 47.0099 31.7493 0.3002 80.9210 1.9459 50.4462 35.7261 73.8065
temp: 298.150 k
press: 1.00000 atm
elementType: 8 8 8 6 6 6 6 6 6 6 6 6 6 6 6 6 1 1 1 1 1 1 1 1 1 1 1 1 1 1 1 1 1 1 1 1 1 1
symmnumber: 1
zpe: 867131.3 jmol-1
zpe.correction: 0.330273 hartree
zpe.thermalcorrener: 0.344049 hartree
zpe.thermalcorrenthalpy: 0.344993 hartree
zpe.thermalcorrgfe: 0.290600 hartree
zpe.sumelectzpe: -732.941788 hartree
zpe.sumelectthermal: -732.928011 hartree
zpe.sumelectthermalent: -732.927067 hartree
zpe.sumelectthermalfe: -732.981460 hartree
dipole: 4.2128 -0.0037 0.4017
dipole: 4.2319
quadrupole: -87.0316 -99.9775 -98.9519
quadrupole: -0.0025 -0.3529 -0.0023
quadrupole: 8.2888 -4.6572 -3.6315 -0.0025 -0.3529 -0.0023
hfenergy: -733.2720604 hartree
pointgroup: C01 [X(C13H22O3)]
dipole: -1.6558147 -0.0010774 -0.174218 debye
polarizability: 178.9375435|0.0325998|129.8584619|1.1100647|0.1054915|118.8448484 unknown
InChI: InChI=1S/C13H22O3/c1-10(2)12-7-14-13(15-8-12,16-9-12)11-5-3-4-6-11/h10-11H,3-9H2,1-2H3
charge 0 multiplicity 1
38 atoms
O  0.261779 0.005267 -1.114016
O  0.119532 -1.202762 0.951302
O  0.116721 1.188411 0.965164
C  -1.901062 -0.004575 0.105964
C  0.647705 -0.002745 0.298407
C  2.164905 -0.001604 0.426722
C  -1.220463 0.002074 -1.28513
C  -1.36634 -1.251618 0.861399
C  -1.369004 1.236898 0.87226
C  -3.466993 -0.005991 0.053721
C  2.859003 -1.211674 -0.248399
C  2.85657 1.216109 -0.236546
C  4.351557 -0.77977 -0.351732
C  4.350599 0.790313 -0.329811
C  -4.060723 1.267281 -0.604496
C  -4.05788 -1.265156 -0.633818
H  2.377849 -0.00628 1.513068
H  -1.479456 -0.898461 -1.872238
H  -1.48382 0.905457 -1.865891
H  -1.767732 -1.28744 1.893332
H  -1.626071 -2.188211 0.336402
H  -1.628675 2.177462 0.354301
H  -1.77241 1.264102 1.903674
H  -3.803618 -0.018503 1.113757
H  2.420923 -1.353344 -1.253056
H  2.717036 -2.147969 0.316699
H  2.706081 2.148637 0.332583
H  2.425629 1.36078 -1.243958
H  4.822417 -1.180791 -1.267281
H  4.928716 -1.17463 0.504964
H  4.911743 1.160874 0.548249
H  4.836444 1.218608 -1.224939
H  -3.759139 1.355468 -1.664792
H  -5.164351 1.218749 -0.579109
H  -3.760185 2.194144 -0.085808
H  -3.762001 -1.324207 -1.697725
H  -5.161587 -1.223075 -0.601184
H  -3.7498 -2.203629 -0.141136
