program: Gaussian 09
title: 000175884
version: EM64L-G09RevD.01
frameworkgroup: C1[X(C17H25N11O3)]
method: RPBEPBE
basis: SDD
operation: Freq
keyword: #p
keyword: freq=noraman
keyword: PBEPBE/SDD
title: #p freq=noraman PBEPBE/SDD
converged: YES YES NO NO
title: Mulliken charges:
elementType: O O O N N N N N N N N N N N C C C C C C C C C C C C C C C C C H H H H H H H H H H H H H H H H H H H H H H H H H
charge: -0.310281 -0.297182 -0.276218 -0.151522 -0.127737 -0.385785 -0.190116 -0.410115 -0.366270 -0.640296 -0.183574 -0.345548 -0.658885 -0.634322 0.252830 0.390153 -0.472629 -0.411555 0.208879 0.103308 0.151254 -0.301321 -0.648531 0.151692 -0.383778 -0.643379 -0.436801 0.117185 0.127881 -0.532366 0.256198 0.290282 0.257700 0.313917 0.335701 0.309915 0.234436 0.225568 0.239096 0.257153 0.364441 0.237856 0.239203 0.308799 0.354676 0.220854 0.244978 0.231994 0.239208 0.330019 0.317907 0.200498 0.349274 0.318151 0.304369 0.322836
chargesum: 0.00000
title: Mulliken charges with hydrogens summed into heavy atoms:
elementType: O O O N N N N N N N N N N N C C C C C C C C C C C C C C C C C
charge: -0.310281 -0.297182 -0.276218 -0.151522 -0.127737 -0.050084 -0.190116 -0.045674 -0.011593 0.007630 -0.183574 -0.145050 0.008540 -0.007117 0.252830 0.390153 -0.182347 -0.153856 0.208879 0.103308 0.151254 0.012596 0.121388 0.151692 0.112470 0.142478 0.029031 0.117185 0.127881 -0.061164 0.256198
polarizability: 4.46113837e+02 -6.54039662e+00 3.55321560e+02 -3.42525666e+00 1.27783401e+01 1.41513299e+02
1716.lowfreq: -3.4732 -2.6840 -0.0008 0.0005 0.0011 2.8807 8.3691 13.3139 16.8678
frequency: 8.2281 13.2443 16.8605 25.8253 28.1448 36.8884 42.2123 47.4118 57.9672 63.4074 73.6083 85.0150 87.4429 90.7891 98.1322 107.5277 112.5803 136.8702 155.4622 172.2047 181.0447 192.6656 205.7663 211.3334 224.2747 226.5261 253.2611 283.7045 293.1649 310.1910 322.4300 340.1341 361.4316 372.6588 379.5059 386.5419 403.4148 425.0799 428.7596 438.6229 440.9120 459.5326 482.3522 490.8310 491.9581 503.0483 517.7561 529.1338 539.0386 576.6037 598.6421 605.4274 613.7425 624.2112 646.2856 651.9599 664.5591 678.9544 679.0934 704.9798 721.6054 732.4135 741.1331 755.7504 756.6262 783.3671 787.5611 794.3199 828.9666 837.7371 840.0111 865.7173 867.2093 872.0617 919.2987 930.0983 974.4747 978.6086 994.2580 1006.7223 1012.7672 1018.9603 1032.7639 1050.3460 1063.0372 1065.7652 1072.1109 1084.0504 1097.8572 1126.4913 1130.1064 1140.4316 1151.4733 1167.3532 1178.5868 1192.1743 1199.4840 1204.1758 1216.0352 1229.7458 1237.8030 1260.9857 1288.7525 1307.2946 1316.1896 1345.3219 1346.4339 1358.4937 1385.3112 1390.4793 1401.6976 1409.9771 1416.1103 1432.9552 1441.1353 1445.9030 1451.6917 1455.3471 1455.8955 1462.8474 1477.1940 1482.1802 1495.8171 1496.5094 1502.7326 1509.0433 1515.0165 1573.2941 1576.0582 1600.3311 1602.7950 1607.4194 1616.0836 1619.0592 1628.4655 1639.7161 1678.6192 2916.5148 2965.0199 2987.9881 2996.9369 3006.4497 3014.1539 3077.5425 3084.8697 3091.2070 3098.9427 3120.6707 3124.2862 3222.5203 3233.7751 3284.0152 3284.2369 3297.9159 3483.8142 3512.5897 3545.4024 3545.7409 3558.8612 3657.6926 3692.9575 3699.8792
redmass: 5.4194 5.3963 5.8618 4.3394 5.5510 5.4502 3.8620 4.3875 4.6571 4.3854 2.8984 3.0449 4.5733 3.0254 2.1636 2.9190 1.4561 4.6779 4.7321 4.9657 4.5944 3.5518 4.8672 5.5265 3.1494 3.5086 3.2947 4.2796 4.9622 3.6768 1.3169 5.1150 6.1939 3.0053 3.4072 6.1737 5.7681 2.1097 1.6883 1.2389 1.2205 2.0965 1.5432 1.7910 2.8118 3.7056 1.5116 2.2295 4.3255 3.3280 4.2600 4.2521 2.8349 2.2196 2.0409 3.7137 2.8670 5.0136 4.1846 4.7980 3.9716 2.7337 8.1064 1.4128 1.7359 1.5418 3.7850 4.2482 3.4155 1.4112 1.5415 4.4906 1.1904 2.4448 6.1362 6.1218 2.3635 1.9995 4.6242 2.2627 2.2584 3.2276 1.5054 1.9080 1.9668 1.7240 2.3159 2.0728 1.5467 1.3086 1.3133 2.1768 1.9030 1.9242 2.1757 1.2935 1.5928 1.1010 2.0363 2.2785 1.8301 1.7616 5.2871 1.3122 1.4779 1.3987 4.3960 3.8098 2.9677 3.3902 2.8550 2.8206 2.5656 2.3034 2.2454 1.8961 1.1379 1.5099 1.8323 1.2186 1.2406 1.2687 2.1106 1.0541 1.0806 2.2185 2.7428 6.1225 7.1588 5.2593 5.2589 1.2653 1.9380 2.1551 2.2247 2.0338 3.7649 1.0559 1.1014 1.0360 1.0334 1.0653 1.0602 1.1001 1.1021 1.1023 1.0994 1.1028 1.1011 1.0980 1.0984 1.0803 1.0984 1.0756 1.0776 1.0455 1.0454 1.0764 1.0456 1.1038 1.1030 1.1036
irintensity: 0.0849 0.0083 2.9368 0.9918 8.7789 4.5934 0.2925 4.5463 1.1621 1.7079 9.9195 2.7831 3.3718 2.2492 5.5484 1.7662 1.6135 9.0960 3.2522 0.6816 1.7548 2.0440 1.5430 3.5479 12.6269 9.6358 17.2802 3.9319 0.6058 26.3942 73.3886 2.0849 2.9050 34.9506 34.0479 4.7174 14.0083 29.4285 179.2619 77.9499 276.3572 2.3583 156.2207 34.8040 19.1829 2.1559 212.0154 88.2116 3.5889 0.8735 25.4309 17.0026 33.0123 2.8188 55.4122 22.0560 14.6865 16.4017 25.6252 13.8230 9.2990 12.0044 4.8463 28.9452 7.3170 61.2445 23.3731 10.4435 26.5159 37.4613 81.6249 23.3280 105.3063 26.3276 7.0955 1.1009 12.3323 3.0353 11.5938 15.8938 33.0063 5.0159 1.9071 7.1463 39.8718 1.3444 1.4412 26.8376 75.7737 9.6722 1.6345 34.8815 60.6400 9.9771 1.7550 12.8404 49.3571 3.4063 84.5325 67.1002 17.7122 143.8804 20.8640 45.3126 50.8160 1.3022 104.0930 4.7275 123.4948 11.5480 39.6644 29.2947 5.7624 102.9011 172.2214 66.8710 52.0946 173.7090 171.6352 25.1511 70.6500 124.4215 454.3770 31.9393 14.7662 371.4788 561.5342 146.7686 801.8562 222.3435 58.2055 176.1869 18.4723 16.0720 283.9913 199.9754 552.0004 40.6321 27.3565 89.0010 69.9639 13.7495 42.6515 29.6485 6.1488 19.9907 17.1679 5.1752 4.7189 0.7191 5.0708 443.5866 51.2381 30.1176 38.0748 30.0039 32.2824 22.6452 29.5290 17.3653 24.5748 28.6510
temp: 298.150 k
press: 1.00000 atm
elementType: 8 8 8 7 7 7 7 7 7 7 7 7 7 7 6 6 6 6 6 6 6 6 6 6 6 6 6 6 6 6 6 1 1 1 1 1 1 1 1 1 1 1 1 1 1 1 1 1 1 1 1 1 1 1 1 1
symmnumber: 1
zpe: 1162506.8 jmol-1
zpe.correction: 0.442775 hartree
zpe.thermalcorrener: 0.475432 hartree
zpe.thermalcorrenthalpy: 0.476376 hartree
zpe.thermalcorrgfe: 0.372360 hartree
zpe.sumelectzpe: -1488.498119 hartree
zpe.sumelectthermal: -1488.465462 hartree
zpe.sumelectthermalent: -1488.464518 hartree
zpe.sumelectthermalfe: -1488.568534 hartree
dipole: -12.9596 -2.1043 0.0004
dipole: 13.1293
quadrupole: -109.8039 -179.0617 -187.3912
quadrupole: -37.7784 -2.8183 -3.5241
quadrupole: 48.9484 -20.3094 -28.6389 -37.7784 -2.8183 -3.5241
hfenergy: -1488.940894 hartree
pointgroup: C01 [X(C17H25N11O3)]
dipole: 5.060302 0.8917853 0.5293086 debye
polarizability: 444.4441043|-7.650061|352.1914103|23.7232365|27.5049218|146.3131813 unknown
InChI: InChI=1S/C17H25N11O3/c1-27-7-9(24-13(29)6-23-17(20)21)5-10(27)15(30)26-12-8-28(2)14(25-12)16(31)22-4-3-11(18)19/h5,7-8,18,22,24,26H,3-4,6,19-21H2,1-2H3
charge 0 multiplicity 1
56 atoms
O  -0.55875 3.730296 0.487064
O  -6.674751 0.041826 -0.472228
O  3.023314 -1.774079 -0.202051
N  2.341336 3.084213 0.925186
N  -4.486726 2.090145 0.003212
N  -0.968211 1.435398 0.484957
N  -3.083699 0.323194 0.229483
N  4.334665 0.10386 0.368553
N  -5.079016 -1.567539 0.146576
N  -3.014887 -3.256896 -1.364826
N  6.608581 -1.122178 0.271359
N  -4.007985 -5.449878 -1.044367
N  8.169624 -2.951217 0.038208
N  8.872252 -0.857433 0.834068
C  1.320826 2.170503 0.610963
C  3.335543 1.078028 0.531074
C  1.92656 0.916976 0.356556
C  3.563338 2.424482 0.886534
C  -2.354708 1.504343 0.307034
C  -4.381968 0.704526 0.04829
C  -0.105966 2.53336 0.529203
C  -3.202279 2.617655 0.171547
C  2.187128 4.490055 1.345136
C  -5.489702 -0.275663 -0.112977
C  -5.913567 -2.744145 -0.121828
C  -5.711259 2.898394 -0.160243
C  -5.470755 -3.524611 -1.393903
C  4.142212 -1.215474 0.027505
C  -4.08731 -4.153382 -1.265435
C  5.469952 -1.995642 -0.064625
C  7.815456 -1.638436 0.361599
H  1.457477 -0.009716 0.034112
H  4.492848 2.944807 1.109389
H  -2.979933 3.677761 0.183793
H  -0.58737 0.492364 0.586326
H  1.202759 4.849269 1.012956
H  2.254458 4.577758 2.445087
H  2.984002 5.098618 0.884868
H  -5.886156 -3.423276 0.749816
H  -6.947949 -2.383587 -0.254819
H  5.342229 0.317148 0.501644
H  -5.581851 3.602727 -0.999282
H  -5.914088 3.467769 0.763271
H  -6.547668 2.2161 -0.372167
H  -4.102575 -1.686997 0.438817
H  -5.514948 -2.843574 -2.264958
H  -6.180795 -4.350426 -1.56039
H  5.518173 -2.392712 -1.103649
H  5.373071 -2.87365 0.612347
H  -3.16264 -2.268508 -1.566831
H  -2.053235 -3.585868 -1.289605
H  -3.026925 -5.791279 -0.945289
H  7.48842 -3.561471 -0.403916
H  9.022144 -3.369312 0.402409
H  9.823135 -1.030279 0.515228
H  8.63247 0.082355 1.14112
