program: Gaussian 09
title: 000175694
version: EM64L-G09RevD.01
frameworkgroup: C1[X(C8H16)]
method: RPBEPBE
basis: SDD
operation: Freq
keyword: #p
keyword: freq=noraman
keyword: PBEPBE/SDD
title: #p freq=noraman PBEPBE/SDD
converged: YES YES NO NO
title: Mulliken charges:
elementType: C C C C C C C C H H H H H H H H H H H H H H H H
charge: -0.021070 -0.453740 -0.697330 -0.708932 -0.189727 -0.176138 -0.437518 -0.669845 0.193835 0.196360 0.197924 0.207302 0.199414 0.231955 0.206491 0.213066 0.211385 0.223046 0.219653 0.206046 0.202509 0.220526 0.210505 0.214283
chargesum: 0.00000
title: Mulliken charges with hydrogens summed into heavy atoms:
elementType: C C C C C C C C
charge: 0.172764 -0.059456 -0.058659 -0.077990 0.033319 0.043515 -0.028963 -0.024530
polarizability: 1.16716598e+02 -4.03632544e+00 7.54781241e+01 -4.34177740e+00 1.30985766e+00 7.46953366e+01
1716.lowfreq: -8.1664 -0.0002 0.0002 0.0006 11.4106 18.0627 41.3439 63.4717 107.9778
frequency: 41.2271 63.4262 107.9759 120.9700 187.8389 209.8510 226.0201 241.7448 304.5321 313.8929 394.2616 406.8457 426.1705 518.4235 764.6168 784.2913 836.8089 867.0565 910.3910 916.1186 933.5659 959.0330 975.7986 1008.8767 1055.2738 1067.7705 1105.2948 1125.5961 1168.3764 1174.7859 1216.1372 1242.8483 1263.9928 1287.8229 1295.7230 1323.5085 1329.2800 1339.2510 1374.4419 1384.5902 1391.6265 1451.9320 1463.0805 1465.6943 1471.3610 1475.0652 1479.4455 1484.0695 1486.0977 1685.0187 2947.1806 2955.9943 2961.3663 2965.5615 2968.9453 2976.0695 3011.4881 3021.8128 3056.4701 3057.0742 3063.7042 3066.7996 3068.1493 3073.5136 3075.3415 3080.8356
redmass: 2.4498 2.7758 2.2437 2.0878 1.5752 1.1523 1.2773 1.1264 2.4138 2.3804 2.3834 2.5740 1.9222 2.3930 1.5285 1.4848 1.8739 1.7852 1.4055 1.3111 1.7840 1.5170 1.1229 2.0883 1.4920 1.7524 2.3910 2.2427 2.1704 1.8242 1.4330 1.1833 1.2073 1.2793 1.3060 1.4047 1.4948 1.4852 1.2143 1.2019 1.2159 1.0907 1.0743 1.0456 1.0589 1.0431 1.0476 1.0603 1.0550 6.5942 1.0602 1.0833 1.0618 1.0355 1.0361 1.0353 1.0985 1.0970 1.0936 1.0990 1.0978 1.0939 1.0969 1.0971 1.0992 1.1005
irintensity: 0.1133 0.0958 0.0950 0.5628 0.3102 0.1639 0.2358 0.0513 0.2546 1.6786 0.5646 0.5549 1.1396 0.5768 6.4003 2.9547 1.6323 1.7175 11.2410 1.4699 4.7714 1.0925 56.8413 2.6872 17.0073 1.6768 1.2593 2.1191 1.8759 12.4634 1.8847 0.3732 0.6487 0.2177 2.1090 4.4043 0.6777 1.8302 17.6415 10.2607 13.8732 4.6044 6.8415 2.1952 6.9273 10.7171 15.4444 12.6937 14.0374 0.0548 38.9692 20.3846 45.0840 42.4493 28.8060 38.6804 24.0971 7.9387 4.5741 9.8603 42.1647 26.5501 67.7857 117.9652 40.7300 61.5216
temp: 298.150 k
press: 1.00000 atm
elementType: 6 6 6 6 6 6 6 6 1 1 1 1 1 1 1 1 1 1 1 1 1 1 1 1
symmnumber: 1
zpe: 571086.0 jmol-1
zpe.correction: 0.217515 hartree
zpe.thermalcorrener: 0.228378 hartree
zpe.thermalcorrenthalpy: 0.229323 hartree
zpe.thermalcorrgfe: 0.181009 hartree
zpe.sumelectzpe: -313.760900 hartree
zpe.sumelectthermal: -313.750037 hartree
zpe.sumelectthermalent: -313.749093 hartree
zpe.sumelectthermalfe: -313.797406 hartree
dipole: -0.0392 0.0070 -0.0961
dipole: 0.1040
quadrupole: -51.1081 -54.5689 -50.8681
quadrupole: -0.2772 -0.3764 0.3326
quadrupole: 1.0736 -2.3872 1.3136 -0.2772 -0.3764 0.3326
hfenergy: -313.9784152 hartree
pointgroup: C01 [X(C8H16)]
dipole: -0.015132 -0.0040764 0.0378076 debye
dipolederiv: 0.149564 -0.0105231 0.0105125 -0.0602798 0.1302671 0.0030363 0.1157618 0.0172937 0.1722892 -0.1007411 0.0151179 0.0204418 0.0204851 0.120615 0.0425055 -0.0476235 0.0062243 0.1071617 -0.0268939 -0.0408104 -0.0007909 -0.0256072 -0.090626 -0.0274975 -0.018136 -0.0121667 0.0858591 -0.0938059 -0.0270578 0.0367287 0.0241015 0.0387937 0.0186508 -0.0091298 0.0066628 0.0884038 0.0942673 0.0157218 -0.012737 0.1254599 -0.2602603 0.0486675 -0.1491846 0.0682353 0.1197659 0.099985 0.0755837 -0.0101178 0.0054143 -0.2893766 0.0295011 -0.0772891 -0.0036132 0.1197855 0.0098646 -0.0490039 0.0402162 -0.0790887 0.1354354 -0.0329796 -0.0441671 -0.020464 0.1186022 -0.0032834 -0.0496077 -0.010062 -0.0051222 -0.0016703 -0.0137409 0.0722751 -0.0081407 0.0918404 0.0367439 -0.0029957 0.0342262 0.0007171 0.0176025 -0.0334164 0.0119968 -0.021819 -0.2097136 -0.0482155 -0.0973833 -0.0149694 -0.0908165 -0.1598235 -0.0242188 0.0209455 -0.0483371 0.0752884 0.0240464 0.0163261 -0.0224639 0.0168655 0.0720646 -0.0518449 0.0238154 0.007007 -0.1696019 -0.0368749 0.1479774 -0.0781502 0.1261427 -0.0617895 0.0563975 -0.0795667 0.0749637 0.0447872 0.0847688 -0.0008894 0.0144065 -0.0120374 0.0610769 0.0151196 0.021207 -0.0596806 -0.1737109 -0.1178507 -0.1065422 0.0633089 -0.1064997 0.0681696 -0.0029643 0.0624214 0.0097396 0.0589257 0.0690059 -0.0091312 -0.0278937 -0.0090653 0.0874844 -0.0216028 0.060785 -0.0003988 -0.1785884 -0.1093167 0.0980817 -0.0502473 0.1521454 -0.0183992 0.069247 -0.0710758 0.06633 0.0515548 0.0581134 -0.0551655 0.0024584 -0.1168985 -0.1621056 -0.0679347 -0.0138677 -0.0729691 0.0663611 0.0300454 -0.0131302 0.0290333 -0.0392412 0.1512776 -0.0160436 0.0574319 -0.0289194 -0.1435742 0.0269913 -0.0205352 0.0405007 -0.0033914 0.153158 -0.0348399 0.0511994 -0.0235772 -0.144705 0.0473126 -0.0343307 -0.0505816 -0.0333923 0.0466862 -0.0403258 0.0345095 -0.0587711 -0.1731364 -0.1152682 0.0922041 -0.0416152 0.10493 -0.0781522 0.0539489 -0.0283849 0.0872758 0.0611784 0.0358387 0.124163 -0.0641455 0.0695638 -0.0805623 0.0561528 -0.0605601 0.0754049 0.0476274 0.1074669 -0.0066847 0.0081797 -0.0061757 0.0578559 -0.0176893 -0.0383528 -0.0652988 -0.176922 -0.221764 -0.0613847 0.0837614 -0.0582095 0.0622785 -0.0081285 0.1049894 0.0050186 0.0605216 unknown
polarizability: 116.6034661|4.6898801|75.5663189|4.197172|1.3862728|74.7202734 unknown
InChI: InChI=1S/C8H16/c1-4-5-6-7-8(2)3/h5-6,8H,4,7H2,1-3H3
charge 0 multiplicity 1
24 atoms
C  2.065041 -0.147783 0.337299
C  1.030382 0.867846 -0.237768
C  1.708677 -1.600026 -0.054767
C  3.495217 0.215085 -0.125966
C  -0.359021 0.723978 0.347314
C  -1.496228 0.489689 -0.359192
C  -2.884153 0.35147 0.233386
C  -3.533492 -1.020888 -0.084095
H  2.02993 -0.069605 1.445416
H  1.408893 1.892422 -0.032785
H  0.989531 0.758311 -1.340755
H  2.409999 -2.320509 0.406216
H  1.764489 -1.728786 -1.153607
H  0.68317 -1.860706 0.263359
H  3.570114 0.17276 -1.230029
H  4.240518 -0.489259 0.288423
H  3.776487 1.236555 0.193177
H  -0.431217 0.825762 1.443516
H  -1.42667 0.37928 -1.45434
H  -2.83744 0.499045 1.329728
H  -3.539608 1.153033 -0.167213
H  -2.937575 -1.845887 0.34627
H  -3.597303 -1.185274 -1.176171
H  -4.55774 -1.081512 0.328183
