program: Gaussian 09
title: 000175737
version: EM64L-G09RevD.01
frameworkgroup: C1[X(C18H21NO3)]
method: RPBEPBE
basis: SDD
operation: Freq
keyword: #p
keyword: freq=noraman
keyword: PBEPBE/SDD
title: #p freq=noraman PBEPBE/SDD
converged: YES YES NO NO
title: Mulliken charges:
elementType: O O O N C C C C C C C C C C C C C C C C C C H H H H H H H H H H H H H H H H H H H H H
charge: -0.235292 -0.249172 -0.227358 -0.023249 0.167007 -0.078006 -0.456628 -0.470566 -0.355588 -0.346729 -0.353368 0.127921 -0.411853 -0.411153 -0.387037 0.392577 -0.326953 -0.389870 -0.372690 -0.365658 0.405076 -0.261123 0.187199 0.205148 0.200379 0.218653 0.197318 0.225319 0.231481 0.225055 0.223835 0.226570 0.233104 0.205972 0.195381 0.195050 0.206251 0.205685 0.193608 0.262710 0.278345 0.256213 0.256437
chargesum: 0.00000
title: Mulliken charges with hydrogens summed into heavy atoms:
elementType: O O O N C C C C C C C C C C C C C C C C C C
charge: -0.235292 -0.249172 -0.227358 -0.023249 0.167007 0.109193 -0.051101 -0.054595 0.101212 0.102162 0.106305 0.127921 -0.010501 -0.009852 0.012256 0.392577 -0.064244 -0.111524 -0.116477 -0.109221 0.405076 -0.261123
polarizability: 3.15263600e+02 3.52563770e-01 1.74928322e+02 -5.64248957e+00 -2.96220739e+00 1.30298429e+02
1716.lowfreq: -24.4007 -9.8581 -3.2592 -0.0005 0.0008 0.0011 16.9870 34.5036 50.7345
frequency: 11.7660 34.4549 50.7159 58.5724 78.7902 119.3114 136.4671 161.8518 173.0869 189.5658 206.8732 220.9616 287.2763 289.5073 303.8478 320.4003 321.8294 360.4224 401.2573 408.5887 424.0323 427.9375 453.5268 475.5601 483.2342 500.9677 534.7950 547.8223 552.4577 560.4442 578.3596 638.4755 668.7202 715.2230 742.2585 766.5057 784.4180 796.8641 818.9179 832.9302 846.0368 858.7436 878.3450 885.4471 890.9652 902.8982 915.4147 916.8977 928.4070 929.6394 957.7655 965.4294 968.8022 982.9647 995.0803 1004.0840 1013.9920 1050.8036 1054.4816 1057.1919 1073.9237 1103.2415 1112.9889 1120.9757 1126.0874 1154.4404 1159.4879 1169.9554 1189.4064 1190.2644 1201.4411 1218.4694 1252.5261 1258.8500 1263.5645 1269.4244 1306.7421 1307.9655 1314.6432 1319.5430 1322.9401 1325.2131 1333.1543 1338.9505 1344.5618 1346.5387 1359.3537 1366.1450 1366.6894 1407.6012 1458.8784 1463.2761 1464.4092 1467.3018 1467.8381 1470.5132 1477.2343 1482.1386 1503.9729 1572.8028 1625.5598 2177.5275 2923.5438 2962.7154 2966.9014 2968.0109 2968.3448 2969.3958 2992.5285 2996.8172 2999.7574 3026.9883 3030.9283 3033.0050 3034.4788 3045.2510 3067.2917 3073.1143 3082.4833 3156.1281 3157.4347 3180.1816 3185.2135
redmass: 3.8036 6.9916 5.3064 3.4929 4.0698 5.5447 5.5191 3.3265 4.8501 5.5988 3.2017 1.8864 5.2228 2.6810 5.8864 1.8739 4.7890 2.2964 2.8615 3.3352 3.9061 3.1927 2.9301 4.9052 1.6457 5.9107 6.2058 7.2974 6.8711 7.1796 3.1542 7.4483 4.2511 4.2211 3.8160 6.2527 1.4643 2.7689 4.1850 2.4555 1.8987 1.2673 2.0381 2.9724 1.5276 4.8516 1.9989 1.6226 6.0400 6.7146 3.7341 2.2822 2.2560 1.4201 1.3757 3.0150 3.3715 3.0200 1.7071 1.5041 1.3755 1.9982 2.5507 1.3735 1.4990 1.8517 3.0683 1.1446 1.3472 1.3905 2.1829 1.3426 1.6489 1.3737 1.3811 1.2938 1.2788 1.2987 1.3204 1.9020 1.8499 1.4660 1.3685 1.3648 1.4998 1.4758 1.3860 4.6409 1.5290 3.4916 1.0892 1.0908 1.0876 1.0821 1.0822 1.0815 1.0969 1.0996 2.7447 7.5158 6.3257 12.6328 1.0818 1.0629 1.0634 1.0628 1.0648 1.0603 1.0631 1.0580 1.0603 1.0952 1.0993 1.0939 1.1025 1.1036 1.1079 1.1069 1.1020 1.0896 1.0900 1.0960 1.0966
irintensity: 0.0410 0.3065 0.2042 0.0265 0.0592 0.9088 5.4903 4.4040 7.1167 0.9035 3.2642 0.2925 4.7075 1.0002 1.4777 1.7320 9.8349 0.2074 0.0571 1.5113 0.4734 0.2297 1.2433 0.5487 1.2171 0.8032 5.5966 0.2232 2.2074 1.0176 11.8007 1.3149 2.5394 6.8356 9.2665 0.2642 0.0202 1.9893 10.3257 200.1903 5.6344 2.6331 5.2222 8.6690 8.0964 75.6695 14.7067 2.0643 28.1620 21.1259 48.3189 12.3746 18.3348 2.1287 0.1423 14.4129 92.1106 155.8192 31.7276 0.1096 0.2486 12.6640 0.0749 1.4318 2.9094 0.4320 13.8063 7.0058 1.5691 0.3968 10.2846 1.9302 0.7958 1.1031 3.3583 4.5538 1.4092 0.8652 22.5412 79.5956 99.9406 26.0726 0.2592 0.2721 1.5380 3.9003 13.7195 0.1508 10.4050 15.1496 2.0895 6.9681 8.7570 5.5818 6.6525 19.9641 2.1107 1.1717 0.3066 0.7799 1.1550 45.7979 15.2325 19.6173 56.0322 41.9370 8.8392 40.1403 53.5312 40.9128 57.4784 93.3610 62.6332 24.3666 2.7843 115.1945 16.2401 27.0807 26.2243 3.1544 4.0384 4.3141 0.3460
temp: 298.150 k
press: 1.00000 atm
elementType: 8 8 8 7 6 6 6 6 6 6 6 6 6 6 6 6 6 6 6 6 6 6 1 1 1 1 1 1 1 1 1 1 1 1 1 1 1 1 1 1 1 1 1
symmnumber: 1
zpe: 930212.8 jmol-1
zpe.correction: 0.354299 hartree
zpe.thermalcorrener: 0.373363 hartree
zpe.thermalcorrenthalpy: 0.374307 hartree
zpe.thermalcorrgfe: 0.305809 hartree
zpe.sumelectzpe: -977.269703 hartree
zpe.sumelectthermal: -977.250639 hartree
zpe.sumelectthermalent: -977.249695 hartree
zpe.sumelectthermalfe: -977.318193 hartree
dipole: 9.7552 0.0911 -0.5170
dipole: 9.7693
quadrupole: -169.7829 -122.6721 -133.1664
quadrupole: -0.8582 2.1050 -1.0458
quadrupole: -27.9091 19.2017 8.7074 -0.8582 2.1050 -1.0458
hfenergy: -977.6240023 hartree
pointgroup: C01 [X(C18H21N1O3)]
dipole: -3.8392777 -0.0149149 -0.180631 debye
polarizability: 315.3341024|0.0514392|172.0499276|4.3154605|11.3774157|133.106321 unknown
InChI: InChI=1S/C18H21NO3/c19-10-14-6-8-16(9-7-14)18-20-11-17(12-21-18,13-22-18)15-4-2-1-3-5-15/h6-9,15H,1-5,11-13H2
charge 0 multiplicity 1
43 atoms
O  0.139172 1.212867 -0.840091
O  0.131708 -1.173294 -0.925622
O  0.069162 -0.0492 1.185317
N  7.560169 0.034538 0.334146
C  -1.943116 0.00199 -0.250236
C  -3.501392 0.006467 -0.338623
C  -4.142893 -1.305736 0.195655
C  -4.155661 1.228892 0.366496
C  -1.32212 1.388974 -0.580138
C  -1.309206 -0.988211 -1.267638
C  -1.385749 -0.395469 1.143101
C  0.607467 -0.009667 -0.185963
C  -5.677139 -1.308686 -0.00155
C  -5.693925 1.230936 0.190563
C  -6.331188 -0.087607 0.685313
C  2.115153 -0.007065 -0.115576
C  2.780332 1.170666 0.297984
C  2.856168 -1.172382 -0.415698
C  4.182565 1.187287 0.414234
C  4.259304 -1.165008 -0.302948
C  4.932654 0.015824 0.11598
C  6.368027 0.026359 0.23482
H  -3.756822 0.084253 -1.420936
H  -3.925226 -1.405425 1.27922
H  -3.702062 -2.191055 -0.3015
H  -3.744603 2.174904 -0.03468
H  -3.91253 1.206275 1.449419
H  -1.741747 1.819066 -1.507141
H  -1.44499 2.102667 0.255062
H  -1.755386 -1.994781 -1.213879
H  -1.385628 -0.599354 -2.301724
H  -1.849999 0.179139 1.96288
H  -1.496154 -1.47856 1.3363
H  -6.105131 -2.248439 0.397093
H  -5.908795 -1.286779 -1.086756
H  -5.93542 1.370199 -0.88385
H  -6.129847 2.094346 0.728954
H  -7.421589 -0.079236 0.495611
H  -6.197101 -0.171378 1.783779
H  2.193854 2.067525 0.514548
H  2.326797 -2.071554 -0.74041
H  4.702842 2.095766 0.732573
H  4.839042 -2.063556 -0.535291
