program: Gaussian 09
title: 000175732
version: EM64L-G09RevD.01
frameworkgroup: C1[X(C17H21BrO3)]
method: RPBEPBE
basis: SDD
operation: Freq
keyword: #p
keyword: freq=noraman
keyword: PBEPBE/SDD
title: #p freq=noraman PBEPBE/SDD
converged: YES YES NO NO
title: Mulliken charges:
elementType: Br O O O C C C C C C C C C C C C C C C C C H H H H H H H H H H H H H H H H H H H H H
charge: -0.000375 -0.234976 -0.249592 -0.228142 0.166852 -0.077128 -0.456777 -0.470816 -0.355905 -0.347146 -0.353624 0.133241 -0.411712 -0.411097 -0.386797 0.388290 -0.332872 -0.396543 -0.189143 -0.178956 -0.204800 0.186151 0.205048 0.200406 0.218810 0.197265 0.223556 0.229919 0.223279 0.222438 0.224588 0.231655 0.205143 0.194979 0.194647 0.205421 0.204739 0.193301 0.259908 0.276010 0.250333 0.250420
chargesum: 0.00000
title: Mulliken charges with hydrogens summed into heavy atoms:
elementType: Br O O O C C C C C C C C C C C C C C C C C
charge: -0.000375 -0.234976 -0.249592 -0.228142 0.166852 0.109023 -0.051322 -0.054741 0.097570 0.098571 0.102619 0.133241 -0.011590 -0.011029 0.011243 0.388290 -0.072964 -0.120532 0.061190 0.071464 -0.204800
polarizability: 3.12240078e+02 -7.54908133e-02 1.73638667e+02 -3.15719871e+00 -3.09153727e+00 1.27797748e+02
1716.lowfreq: -22.2948 -7.7021 -2.0747 -0.0005 -0.0002 0.0003 16.5566 29.9104 45.7326
frequency: 12.2714 29.8538 45.6843 58.6222 79.0601 124.2124 145.4968 153.0482 169.7308 205.7447 221.5734 228.0335 269.3063 291.3314 318.9269 323.4617 337.7034 369.6010 405.5800 406.0393 411.7370 428.1055 443.3946 458.9765 478.4156 486.5429 531.4449 557.0568 558.8885 621.8400 654.3500 705.4821 714.0387 719.5107 784.3406 796.4960 813.6754 819.8392 836.4242 846.1395 873.3427 879.1263 890.7925 898.1201 915.3265 917.3523 928.0171 930.4846 958.0689 965.8565 967.2889 970.1804 982.6043 992.8924 1007.9002 1045.1173 1053.6379 1057.3707 1061.5556 1073.4165 1103.2909 1112.1885 1113.1271 1126.0360 1154.6847 1160.1261 1170.7057 1185.0947 1189.4031 1218.7299 1252.6174 1258.9185 1263.5610 1268.8096 1292.9332 1307.2331 1314.8022 1318.4755 1322.2231 1325.3500 1333.2080 1338.9148 1344.1806 1346.6478 1359.4509 1366.5255 1373.0153 1386.8034 1458.7711 1463.3867 1464.2325 1467.2638 1467.7158 1470.3584 1476.2556 1477.3141 1482.3225 1586.4620 1605.1374 2922.2474 2962.9397 2966.7046 2967.9040 2968.5805 2969.2535 2990.0586 2994.5644 2997.6066 3026.9306 3030.5789 3032.6622 3034.2329 3044.9042 3064.6506 3070.7830 3079.0775 3159.9079 3161.9029 3178.4935 3183.4758
redmass: 3.7871 7.6447 5.6971 3.4721 3.9057 4.7757 4.9733 7.4562 3.2708 3.1776 2.4080 3.5396 6.0801 2.4849 3.0812 2.3704 4.2072 2.4178 6.1543 2.9101 3.2476 3.0829 3.8649 2.9410 4.8106 1.6413 3.5510 6.4821 6.9443 7.1193 4.8520 4.8514 4.8981 3.7946 1.4653 2.7671 2.3663 2.8762 1.2607 1.8881 3.2230 2.1281 1.5191 5.6955 2.0850 1.5408 6.0738 6.5201 3.7692 1.8703 1.9593 1.8709 1.3747 5.4126 2.8300 6.8202 1.5405 1.4941 2.0756 1.3832 1.9996 1.3657 2.4833 1.5092 1.8681 2.9456 1.1487 1.1204 1.3338 1.3376 1.6408 1.3741 1.3859 1.2954 1.2453 1.3109 1.3880 2.1010 1.6827 1.3708 1.3689 1.3635 1.5001 1.4786 1.3709 1.4554 6.9703 3.2550 1.0892 1.0909 1.0879 1.0822 1.0823 1.0816 2.1763 1.1566 1.1507 7.9860 6.2276 1.0819 1.0631 1.0636 1.0640 1.0607 1.0625 1.0630 1.0580 1.0603 1.0953 1.0983 1.0951 1.1027 1.1036 1.1078 1.1066 1.1020 1.0887 1.0891 1.0966 1.0972
irintensity: 0.0028 0.1545 0.1118 0.0533 0.4077 0.5564 1.7861 1.3017 3.5691 2.0976 1.6720 2.6131 0.5279 2.5974 9.7108 1.7382 8.6535 2.1725 16.3062 0.2112 2.1404 0.1421 3.4708 4.0688 0.3652 2.2653 10.4079 0.5312 2.0280 2.0540 8.2838 3.0654 6.3727 4.1704 0.0215 1.3985 127.1248 64.6963 3.6110 4.9890 22.4830 12.0692 8.9509 80.8009 9.0277 1.1563 31.3117 13.0941 31.2534 5.2309 15.9145 8.9219 0.2102 172.5397 26.4429 129.6937 1.3562 0.2461 91.2112 0.2908 12.4530 1.4414 0.1627 2.6278 0.3513 12.3920 7.7963 7.9805 0.2788 2.1449 0.8476 1.1479 3.3582 4.7280 0.2799 0.3317 40.9073 108.1733 79.6227 5.6011 0.2902 0.1622 1.4108 3.5968 11.9662 9.5466 1.0442 13.9346 2.0113 6.6160 8.5309 6.3080 5.6401 19.0613 39.2032 1.0811 0.7009 1.9945 47.9685 15.8176 20.0471 49.1732 37.2174 23.7361 37.1078 56.2039 43.5337 58.7841 94.8453 75.7891 9.7175 1.1434 118.0732 17.7398 28.5325 27.7601 2.0639 1.9733 5.8736 0.5926
temp: 298.150 k
press: 1.00000 atm
elementType: 35 8 8 8 6 6 6 6 6 6 6 6 6 6 6 6 6 6 6 6 6 1 1 1 1 1 1 1 1 1 1 1 1 1 1 1 1 1 1 1 1 1
symmnumber: 1
zpe: 907751.3 jmol-1
zpe.correction: 0.345744 hartree
zpe.thermalcorrener: 0.364500 hartree
zpe.thermalcorrenthalpy: 0.365444 hartree
zpe.thermalcorrgfe: 0.296718 hartree
zpe.sumelectzpe: -897.931014 hartree
zpe.sumelectthermal: -897.912259 hartree
zpe.sumelectthermalent: -897.911315 hartree
zpe.sumelectthermalfe: -897.980040 hartree
dipole: 6.8959 0.0207 -0.2051
dipole: 6.8989
quadrupole: -127.1054 -127.9652 -138.3640
quadrupole: -0.2505 -0.6726 -1.1323
quadrupole: 4.0395 3.1797 -7.2192 -0.2505 -0.6726 -1.1323
hfenergy: -898.2767584 hartree
pointgroup: C01 [X(C17H21Br1O3)]
dipole: -2.7115831 -0.0019763 -0.1203446 debye
polarizability: 312.1156118|-0.354231|170.7554929|5.6916791|11.5519547|130.8053876 unknown
InChI: InChI=1S/C17H21BrO3/c18-15-8-6-14(7-9-15)17-19-10-16(11-20-17,12-21-17)13-4-2-1-3-5-13/h6-9,13H,1-5,10-12H2
charge 0 multiplicity 1
42 atoms
Br 7.20388 0.023903 0.347195
O  0.481623 1.194623 -0.836601
O  0.469033 -1.193638 -0.883228
O  0.388506 -0.035037 1.208335
C  -1.608434 -0.000924 -0.247496
C  -3.165505 0.006982 -0.352149
C  -3.817994 -1.294181 0.195488
C  -3.822838 1.242558 0.326734
C  -0.979573 1.379399 -0.589542
C  -0.966009 -1.006656 -1.244297
C  -1.065477 -0.380223 1.156439
C  0.944382 -0.018804 -0.157779
C  -5.350001 -1.294835 -0.018888
C  -5.358926 1.247748 0.133373
C  -6.007097 -0.060516 0.641116
C  2.449489 -0.01707 -0.075958
C  3.112949 1.1594 0.340563
C  3.194588 -1.180208 -0.369143
C  4.51895 1.180176 0.466946
C  4.601889 -1.174873 -0.248251
C  5.244174 0.007639 0.171559
H  -3.409668 0.06905 -1.438211
H  -3.61248 -1.377707 1.282743
H  -3.374635 -2.188519 -0.282868
H  -3.403327 2.180522 -0.084316
H  -3.591762 1.235677 1.41246
H  -1.391261 1.799844 -1.524704
H  -1.107165 2.103453 0.236245
H  -1.417742 -2.010537 -1.183128
H  -1.029648 -0.630343 -2.284101
H  -1.537836 0.205563 1.963768
H  -1.179692 -1.460688 1.362745
H  -5.786249 -2.226594 0.389626
H  -5.569147 -1.289047 -1.106871
H  -5.58753 1.371366 -0.945798
H  -5.797807 2.120985 0.653356
H  -7.095332 -0.050991 0.438987
H  -5.885558 -0.12759 1.742201
H  2.529766 2.059372 0.554787
H  2.67291 -2.083248 -0.696565
H  5.035334 2.089028 0.787674
H  5.182321 -2.07316 -0.476045
