program: Gaussian 09
title: 000175664
version: EM64L-G09RevD.01
frameworkgroup: C1[X(C11H18O2)]
method: RPBEPBE
basis: SDD
operation: Freq
keyword: #pfreq=noraman
keyword: PBEPBE/SDD
title: #p freq=noraman PBEPBE/SDD
converged: YES YES NO NO
title: Mulliken charges:
elementType: O O C C C C C C C C C C C H H H H H H H H H H H H H H H H H H
charge: -0.428619 -0.219538 -0.386509 -0.412687 -0.373816 -0.144836 -0.355090 -0.357408 -0.534632 0.160235 -0.696512 0.230079 -0.511381 0.179588 0.229524 0.241926 0.193060 0.198027 0.185298 0.244458 0.185778 0.192186 0.193862 0.197169 0.262745 0.237078 0.208866 0.215081 0.210915 0.377238 0.277915
chargesum: 0.00000
title: Mulliken charges with hydrogens summed into heavy atoms:
elementType: O O C C C C C C C C C C C
charge: -0.051382 -0.219538 0.022603 0.022298 0.009509 0.099622 0.022874 0.033623 -0.034809 0.160235 -0.061650 0.230079 -0.233466
polarizability: 1.38495537e+02 3.78110724e+00 1.12389194e+02 -2.04965903e+00 -8.23846023e+00 1.11087226e+02
1716.lowfreq: -16.2014 -0.0011 -0.0004 -0.0002 3.9736 15.4729 26.2380 40.2753 47.7203
frequency: 22.0320 40.1498 47.6987 48.7666 67.5677 88.7780 110.2237 118.0711 140.7824 182.4936 212.4875 225.1814 257.0261 278.0742 299.5438 337.9600 418.5246 423.2892 506.5401 529.3743 560.1564 630.1341 638.9493 648.1985 717.1095 723.2307 732.9634 763.3421 800.0357 861.3695 877.0587 891.7283 931.2751 987.0728 993.7702 1021.5997 1025.5071 1054.8877 1066.3219 1078.5637 1082.2261 1119.5171 1145.4194 1192.4940 1205.1284 1213.0417 1240.7311 1246.3949 1256.3713 1282.4367 1289.3241 1289.5133 1299.1067 1323.3060 1341.9174 1355.4300 1360.6334 1362.8409 1386.1291 1453.5014 1458.3474 1462.5938 1464.7630 1472.6448 1475.9084 1480.9559 1487.7329 1667.3387 2142.4449 2950.8925 2953.4554 2959.5079 2967.8690 2971.1738 2979.4797 2986.7264 2989.2280 2998.7834 3005.3493 3023.6862 3036.7404 3049.4424 3058.2642 3067.9834 3070.1980 3425.9575 3515.7568
redmass: 2.2124 4.8541 4.4739 3.0996 4.1725 2.9452 3.6210 1.8219 2.2499 3.4364 3.0360 1.1641 4.6091 3.8560 3.9291 2.3092 3.8250 3.2187 3.2731 2.6542 3.8952 1.4811 1.2495 1.2401 3.0803 1.1210 1.2531 1.7781 1.6677 2.1097 1.6084 1.8009 1.8396 1.7394 2.2823 3.8616 3.0925 2.4329 2.4506 1.7411 1.9199 2.4181 2.0799 1.5508 1.2465 1.2285 1.3382 1.3667 1.4843 1.0945 1.3061 1.1506 1.1000 1.3498 1.4298 1.6391 1.6818 1.6308 1.2174 1.0858 1.0847 1.0677 1.0754 1.0743 1.0428 1.0813 1.0902 8.7536 6.0263 1.0590 1.0601 1.0629 1.0593 1.0366 1.0642 1.0690 1.0955 1.0735 1.0983 1.0991 1.1017 1.1005 1.1019 1.1008 1.0992 1.1591 1.0641
irintensity: 0.0415 0.5941 0.2443 0.1606 0.0234 0.5199 0.1603 0.0616 0.2484 0.4775 0.2632 0.0012 1.2369 0.9144 2.1016 9.9501 6.4640 1.8061 24.3521 21.7175 8.4548 87.8242 88.0726 95.3399 8.4962 16.4432 2.1618 5.9732 0.4854 0.1585 4.0762 2.2939 5.1991 7.5922 28.6434 4.3879 216.2990 54.9647 5.4271 0.3562 0.2791 14.4970 11.6279 1.7460 9.3768 0.4980 2.5195 0.6209 7.7490 1.3332 3.2643 1.1380 2.6225 4.2471 2.2521 2.1725 6.7758 13.9844 10.8213 13.4688 4.8713 0.3552 1.5626 1.7710 12.3712 3.4767 22.5093 188.8430 3.8616 0.8193 3.5071 26.0392 102.8469 35.9696 30.5606 11.1685 6.6690 22.8468 4.9059 10.6560 46.5696 6.8232 55.2848 103.8540 54.7169 60.7913 23.5938
temp: 298.150 k
press: 1.00000 atm
elementType: 8 8 6 6 6 6 6 6 6 6 6 6 6 1 1 1 1 1 1 1 1 1 1 1 1 1 1 1 1 1 1
symmnumber: 1
zpe: 693394.6 jmol-1
zpe.correction: 0.264100 hartree
zpe.thermalcorrener: 0.280209 hartree
zpe.thermalcorrenthalpy: 0.281153 hartree
zpe.thermalcorrgfe: 0.218137 hartree
zpe.sumelectzpe: -579.327441 hartree
zpe.sumelectthermal: -579.311332 hartree
zpe.sumelectthermalent: -579.310388 hartree
zpe.sumelectthermalfe: -579.373404 hartree
dipole: -0.3191 0.1661 -1.6492
dipole: 1.6879
quadrupole: -79.1654 -76.8803 -79.4108
quadrupole: -3.2404 -0.4585 -1.0172
quadrupole: -0.6799 1.6052 -0.9253 -3.2404 -0.4585 -1.0172
hfenergy: -579.5915409 hartree
pointgroup: C01 [X(C11H18O2)]
dipole: -0.1175507 -0.1356285 0.639376 debye
polarizability: 138.7340247|-3.282329|113.8499203|1.7026633|-7.8562096|109.3880124 unknown
InChI: InChI=1S/C11H18O2/c1-3-5-6-7-9-10(8-4-2)11(12)13/h2,10,12H,3,5-9H2,1H3
charge 0 multiplicity 1
31 atoms
O  -2.865779 -2.268778 0.015372
O  -1.415046 -1.325157 -1.528724
C  0.998141 -0.299364 0.432003
C  -0.329516 0.49084 0.467424
C  2.218746 0.600858 0.137591
C  -1.563551 -0.383927 0.776899
C  3.55345 -0.177129 0.104576
C  4.775575 0.716308 -0.206906
C  -2.835982 0.458805 1.144797
C  -1.893224 -1.329221 -0.375726
C  6.104122 -0.06999 -0.241152
C  -3.283439 1.367285 0.073762
C  -3.671565 2.123056 -0.81991
H  1.149985 -0.814386 1.40471
H  0.933906 -1.087056 -0.343589
H  -0.48359 1.001377 -0.501649
H  -0.263283 1.281811 1.241988
H  2.067699 1.109746 -0.83702
H  2.28122 1.403815 0.902401
H  -1.357872 -1.022957 1.659739
H  3.710015 -0.682643 1.080869
H  3.487526 -0.983537 -0.655476
H  4.841582 1.522624 0.552259
H  4.618027 1.220481 -1.182222
H  -3.657974 -0.232462 1.407844
H  -2.598185 1.04842 2.051269
H  6.298259 -0.56265 0.730536
H  6.961956 0.591822 -0.461856
H  6.077221 -0.858562 -1.01679
H  -3.082254 -2.856022 -0.758734
H  -4.00557 2.777794 -1.603886
