program: Gaussian 09
title: 000175810
version: EM64L-G09RevD.01
frameworkgroup: C1[X(C20H21Cl2NO8)]
method: RPBEPBE
basis: SDD
operation: Freq
keyword: #p
keyword: freq=noraman
keyword: PBEPBE/SDD
title: #p freq=noraman PBEPBE/SDD
converged: YES YES NO NO
title: Mulliken charges:
elementType: Cl Cl O O O O O O O O N C C C C C C C C C C C C C C C C C C C C H H H H H H H H H H H H H H H H H H H H H
charge: -0.012051 -0.051040 -0.278816 -0.453180 -0.427807 -0.185772 -0.457907 -0.458802 -0.247150 -0.285308 -0.230780 -0.200328 -0.147284 -0.055457 -0.085897 -0.003749 -0.344789 0.499028 0.191015 -0.338846 -0.343481 -0.763572 -0.342098 -0.394322 0.330860 0.448344 -0.294432 -0.338917 -0.200243 -0.217863 -0.106144 0.204699 0.272375 0.217191 0.251572 0.224892 0.230476 0.205606 0.368240 0.337344 0.374997 0.380756 0.280675 0.265460 0.247550 0.244174 0.284341 0.266723 0.269916 0.328572 0.281141 0.260090
chargesum: 0.00000
title: Mulliken charges with hydrogens summed into heavy atoms:
elementType: Cl Cl O O O O O O O O N C C C C C C C C C C C C C C C C C C C C
charge: -0.012051 -0.051040 -0.278816 -0.084939 -0.090463 -0.185772 -0.082910 -0.078046 -0.247150 -0.285308 -0.230780 0.072047 0.057416 0.161734 0.165675 0.221143 0.091292 0.499028 0.191015 -0.058171 -0.078020 0.012492 -0.075375 -0.124406 0.330860 0.448344 -0.294432 -0.010345 0.080898 0.042227 -0.106144
polarizability: 3.82018084e+02 -2.53885286e+01 2.73676619e+02 -5.02511444e+00 1.08452153e+01 1.99934706e+02
1716.lowfreq: -3.5050 -2.3093 0.0015 0.0015 0.0018 4.0378 14.6168 17.5205 22.3672
frequency: 14.3290 17.4575 22.3527 35.0965 37.5225 44.7132 58.8599 72.7938 85.1143 89.7710 95.1447 107.9897 111.6229 128.5831 132.6652 145.5922 156.9403 165.4620 168.6183 189.2936 206.8749 218.8579 235.2190 253.4580 263.9423 278.1641 302.1659 318.3068 329.3266 332.4472 345.7793 362.6000 371.0908 375.6994 391.0340 402.3509 407.4754 411.5879 433.6568 443.8011 444.9952 450.1643 462.0719 472.6191 498.0960 505.7984 526.6072 539.1706 553.7818 562.6937 573.4721 598.2805 603.2594 617.6521 622.4991 641.0164 664.3213 695.1577 701.5259 727.1407 776.5265 815.7254 826.8819 840.8471 845.0095 855.7452 858.5759 895.5587 930.9618 931.5885 943.3923 957.5226 959.3903 963.7183 972.7711 985.7617 1001.7357 1003.0318 1008.8766 1015.9856 1020.9061 1026.1842 1035.4767 1046.4544 1065.2709 1079.6039 1083.0468 1088.0400 1112.8223 1114.5105 1151.1480 1160.4297 1180.7384 1181.3863 1185.2295 1199.6481 1205.9272 1220.5396 1227.6860 1245.4346 1258.6199 1265.1862 1288.7661 1294.6751 1301.0016 1321.9399 1323.9835 1326.9430 1340.2376 1346.5445 1354.0821 1364.5241 1373.1437 1374.3789 1377.0603 1381.8878 1394.9563 1396.9786 1415.6576 1449.9737 1458.8033 1460.4759 1461.8746 1485.2799 1571.6781 1581.6432 1589.5557 1601.3562 1610.4022 2907.7318 2922.0199 2968.9293 2979.3593 3001.1457 3007.2354 3068.9770 3086.3999 3098.8736 3133.7951 3136.7747 3157.0769 3164.5005 3177.1442 3182.6402 3184.6005 3193.6456 3492.5206 3526.4326 3545.3973 3553.8204
redmass: 7.9111 9.6679 9.0166 7.1033 7.0834 7.4742 4.7549 7.5237 4.9411 5.4199 6.8147 5.9981 5.7863 3.2905 1.5187 4.1302 8.0854 6.0562 3.2751 5.4338 6.4065 4.9294 4.9454 6.3651 5.0234 6.7432 6.4090 5.4677 4.9998 1.2100 6.0317 4.9595 6.2132 4.6561 6.0351 1.3914 3.0195 5.0404 3.9486 2.6684 3.1879 1.5305 3.1252 4.8584 2.1154 1.8860 4.8408 4.4608 3.2018 3.9547 3.9876 4.6398 4.2350 5.0600 5.7992 7.4135 5.0566 6.0775 4.4729 4.9444 6.8355 1.3269 1.3573 1.6651 2.5135 5.9019 1.4103 5.3898 5.6904 6.6402 1.4392 1.3305 3.6057 1.5955 4.0815 7.0516 2.7276 3.7563 2.6358 2.2145 2.7129 4.2950 1.6429 3.0174 2.3574 4.1005 2.5702 3.4344 1.3013 2.3069 1.3563 1.6475 1.3427 1.2911 1.7450 1.3840 2.7500 1.1873 3.8303 1.2208 1.4146 1.1893 1.2036 1.3232 1.2724 1.4500 3.1340 1.3158 1.4555 1.2593 5.2356 1.1857 2.9740 2.0852 1.3422 5.5927 1.2265 1.6002 3.7255 1.0898 2.3948 1.0579 1.0872 2.5510 7.6931 7.3240 7.8111 7.6871 6.8193 1.0820 1.0826 1.0844 1.0680 1.0374 1.0843 1.0860 1.0965 1.0962 1.1014 1.0924 1.0906 1.0890 1.0949 1.0936 1.0966 1.0956 1.0660 1.0659 1.0656 1.0657
irintensity: 0.7553 0.6415 0.0486 0.1658 2.1659 0.7555 0.5411 1.0457 1.6122 2.9647 5.7110 0.9823 1.0400 1.7185 2.0994 2.5893 1.6805 0.1829 2.0131 6.0982 0.9833 10.0451 7.5667 2.4673 11.1556 5.3533 8.0607 9.3556 1.3415 72.4016 20.1274 9.9423 2.7947 12.9903 6.6358 105.6116 6.4452 7.6148 11.1259 28.0729 8.7704 185.6065 24.5396 9.1524 65.7960 32.3644 22.8300 17.7276 3.8044 27.7748 25.1997 26.2224 28.4865 5.0942 0.8481 5.8067 24.1299 12.9364 6.0591 13.7173 40.0856 21.4567 36.9767 67.1044 18.6344 22.6812 18.6479 26.4777 31.5925 324.2734 4.7717 0.5774 82.1749 32.8503 70.8717 53.3254 2.8066 51.8742 18.6685 14.9996 16.5049 103.2330 7.4892 107.5183 6.6096 7.8000 62.2281 24.5271 10.0318 1.8107 3.7594 52.2167 22.6296 7.0483 3.8864 27.9742 27.5109 28.9874 457.2746 14.1924 84.0240 25.3027 35.7406 16.8400 16.1276 72.7737 180.9883 10.2759 10.8093 14.3397 21.2140 23.1739 3.3885 1.5324 33.1274 17.4164 39.0845 28.7787 0.4628 39.3003 314.2925 15.3731 7.0437 229.0759 18.3825 24.4308 17.5904 112.5507 40.9755 20.3249 39.4052 16.3951 54.9870 5.6636 27.1245 12.6137 5.2830 16.5141 10.3784 27.7065 6.5169 3.4744 2.2178 0.1995 0.7903 0.0067 97.8684 11.7728 21.9506 29.4137
temp: 298.150 k
press: 1.00000 atm
elementType: 17 17 8 8 8 8 8 8 8 8 7 6 6 6 6 6 6 6 6 6 6 6 6 6 6 6 6 6 6 6 6 1 1 1 1 1 1 1 1 1 1 1 1 1 1 1 1 1 1 1 1 1
symmnumber: 1
zpe: 1006686.3 jmol-1
zpe.correction: 0.383427 hartree
zpe.thermalcorrener: 0.414372 hartree
zpe.thermalcorrenthalpy: 0.415316 hartree
zpe.thermalcorrgfe: 0.318540 hartree
zpe.sumelectzpe: -2348.990787 hartree
zpe.sumelectthermal: -2348.959842 hartree
zpe.sumelectthermalent: -2348.958898 hartree
zpe.sumelectthermalfe: -2349.055674 hartree
dipole: 5.9119 5.4910 0.7414
dipole: 8.1025
quadrupole: -195.5406 -207.5584 -193.2649
quadrupole: 14.0855 1.6278 11.0040
quadrupole: 3.2474 -8.7705 5.5231 14.0855 1.6278 11.0040
hfenergy: -2349.3742139 hartree
pointgroup: C01 [X(C20H21Cl2N1O8)]
dipole: -2.4813109 -1.9762477 0.3154048 debye
polarizability: 377.6155982|-33.0925135|277.733221|4.9590544|-12.3385721|200.2805899 unknown
InChI: InChI=1S/C20H21Cl2NO8/c1-10(25)23(31-20-19(28)18(27)17(26)16(9-24)30-20)12-3-5-13(6-4-12)29-15-7-2-11(21)8-14(15)22/h2-8,16-20,24,26-28H,9H2,1H3
charge 0 multiplicity 1
52 atoms
Cl 6.176385 1.533121 -1.078017
Cl 6.734948 -3.179854 1.809485
O  -2.227955 -0.606463 -0.578087
O  -6.042298 -2.152026 -0.116627
O  -3.753739 -4.001918 0.079247
O  -3.011378 1.594747 -0.390512
O  -5.511372 0.552669 0.703624
O  0.195486 -1.947435 -0.566298
O  -1.512261 3.979187 1.873833
O  3.281832 0.761492 -1.18554
N  -1.951085 2.303675 0.342702
C  -3.609393 -2.606748 -0.381783
C  -4.696525 -1.728436 0.270291
C  -2.217351 -2.007205 -0.092507
C  -4.601813 -0.23764 -0.120628
C  -3.172593 0.253509 0.14887
C  -1.050136 -2.661124 -0.844213
C  -0.604781 1.964678 -0.026601
C  -2.375684 3.315616 1.231313
C  0.411712 1.880296 0.959416
C  -0.306657 1.669908 -1.380488
C  -3.873241 3.540679 1.328676
C  1.709451 1.468357 0.596517
C  0.98735 1.24511 -1.742033
C  1.984657 1.133213 -0.748257
C  4.037947 -0.147542 -0.417651
C  5.434576 0.062541 -0.325892
C  3.468654 -1.306198 0.164596
C  6.266633 -0.854211 0.346637
C  4.286776 -2.229849 0.84849
C  5.672099 -1.988873 0.930619
H  -4.580755 -1.79681 1.379517
H  -3.776427 -2.669342 -1.471058
H  -2.007539 -2.013233 1.003393
H  -4.831541 -0.132558 -1.200737
H  -2.940296 0.25058 1.235814
H  -0.900992 -3.697732 -0.503742
H  -1.274357 -2.667229 -1.931143
H  -6.097788 -3.137871 -0.016949
H  -3.505145 -4.057224 1.039413
H  -6.419414 0.165851 0.602795
H  0.060668 -0.994944 -0.821439
H  0.189417 2.154332 1.992581
H  -1.097581 1.738467 -2.131463
H  -4.26068 3.942629 0.375163
H  -4.05002 4.271656 2.131676
H  -4.435806 2.611205 1.521673
H  2.497932 1.405611 1.352758
H  1.238276 1.005382 -2.779021
H  2.396107 -1.506631 0.062531
H  7.342967 -0.678697 0.413733
H  3.850028 -3.127617 1.293624
