program: Gaussian 09
title: 000175665
version: EM64L-G09RevD.01
frameworkgroup: C1[X(C12H12FN3O2S)]
method: RPBEPBE
basis: SDD
operation: Freq
keyword: #p
keyword: freq=noraman
keyword: PBEPBE/SDD
title: #p freq=noraman PBEPBE/SDD
converged: YES YES NO NO
title: Mulliken charges:
elementType: S F O O N N N C C C C C C C C C C C C H H H H H H H H H H H H
charge: 0.354003 -0.205548 -0.266843 -0.275485 -0.383767 -0.428196 -0.115299 0.370459 0.173598 -0.283468 -0.173784 -0.328770 -0.322678 -0.390883 -0.375350 0.285678 0.325157 -0.600874 -0.486305 0.299882 0.235359 0.281719 0.343945 0.255938 0.255759 0.280230 0.226001 0.242403 0.239383 0.229576 0.238158
chargesum: 0.00000
title: Mulliken charges with hydrogens summed into heavy atoms:
elementType: S F O O N N N C C C C C C C C C C C C
charge: 0.354003 -0.205548 -0.266843 -0.275485 -0.039822 -0.428196 -0.115299 0.370459 0.173598 0.016414 -0.173784 -0.093411 -0.040959 -0.134945 -0.119591 0.285678 0.325157 0.147761 0.220812
polarizability: 3.07640522e+02 9.83728208e+00 1.88055585e+02 -5.26985951e-01 -1.52484724e+00 8.07833625e+01
1716.lowfreq: -6.3376 -3.8534 -0.0014 -0.0010 0.0012 3.5324 19.9604 25.4805 49.7079
frequency: 19.9174 25.4737 49.7075 55.0526 67.6241 83.6434 122.9751 127.9670 141.3434 168.7704 174.3341 191.3629 216.9262 271.0645 278.3544 289.1191 331.1761 348.7920 363.9249 398.0394 410.7380 428.3113 476.6758 498.5445 541.7469 543.0775 554.4358 603.5860 628.4673 649.4624 669.4910 670.9527 714.9113 721.2628 731.6018 787.8112 817.3255 818.9430 847.0192 877.1177 890.6888 919.4970 950.3038 953.5425 981.1037 1004.3554 1053.0652 1085.6403 1103.5665 1107.5352 1111.8142 1146.8775 1147.7008 1156.7849 1177.7747 1203.5237 1226.3238 1295.3492 1315.5836 1343.0262 1392.0660 1397.0613 1405.6098 1418.5627 1424.6709 1446.2662 1465.3495 1469.4701 1479.8987 1490.9747 1506.7283 1569.0296 1597.7464 1612.8630 1628.3441 2983.0215 2985.3021 3077.8257 3090.3402 3123.2328 3123.3841 3156.0547 3160.4875 3177.6609 3181.2568 3233.2504 3486.2281
redmass: 3.9300 5.0353 5.3455 4.6651 5.3226 4.3741 5.8584 3.7634 1.6288 2.2896 1.2153 7.1307 3.5086 8.5078 7.8810 9.8038 4.8229 7.5083 6.8044 3.9606 2.9381 5.6195 6.1852 3.3256 6.4105 7.1096 5.7979 8.1343 7.2925 2.3863 5.3865 5.8715 2.6210 3.3375 3.4160 6.9567 1.3083 4.7721 1.5804 1.4010 6.3064 5.9091 1.3687 4.9219 1.3513 2.8855 2.3219 6.4705 1.5466 1.3602 1.2557 1.6260 1.5148 1.4988 2.4037 2.3095 1.7508 1.3049 4.0888 5.0274 9.7192 3.7348 1.1555 1.1643 3.9260 1.0600 1.0608 1.1704 1.1822 1.5362 3.0603 7.4769 7.6410 6.3676 6.9099 1.0345 1.0299 1.1002 1.1060 1.1037 1.0996 1.0885 1.0888 1.0966 1.0977 1.0948 1.0761
irintensity: 0.1437 2.2412 1.0025 0.0909 0.6604 4.9353 6.2304 3.3873 1.2139 1.2316 2.7301 6.2869 15.7980 0.2865 0.5194 11.1232 5.8073 0.4562 5.5006 36.4945 0.0134 15.6111 14.0107 6.4461 21.3781 14.3285 18.3381 0.7193 0.2376 10.1581 4.2407 9.8265 69.3763 38.1480 8.7041 20.4095 4.2143 14.4657 86.2651 36.9654 4.1101 40.7375 0.3356 24.5831 0.4163 12.8274 0.6557 29.4137 134.2685 33.2616 0.3598 53.5415 33.5007 57.1985 19.1532 34.1411 2.0885 1.5091 131.9863 0.9925 0.2407 113.3227 28.5906 8.8157 12.5796 4.6032 85.9674 157.4732 216.2027 480.7470 72.0738 375.4970 6.2263 39.0070 203.8867 47.9967 57.3766 27.9412 38.8994 14.6425 5.1599 7.6184 1.2314 4.6920 4.3183 3.0553 120.9211
temp: 298.150 k
press: 1.00000 atm
elementType: 16 9 8 8 7 7 7 6 6 6 6 6 6 6 6 6 6 6 6 1 1 1 1 1 1 1 1 1 1 1 1
symmnumber: 1
zpe: 591994.7 jmol-1
zpe.correction: 0.225479 hartree
zpe.thermalcorrener: 0.244022 hartree
zpe.thermalcorrenthalpy: 0.244966 hartree
zpe.thermalcorrgfe: 0.176214 hartree
zpe.sumelectzpe: -1275.642234 hartree
zpe.sumelectthermal: -1275.623691 hartree
zpe.sumelectthermalent: -1275.622747 hartree
zpe.sumelectthermalfe: -1275.691498 hartree
dipole: 8.0059 -0.0277 0.8972
dipole: 8.0560
quadrupole: -94.0259 -116.8004 -120.0359
quadrupole: -2.0265 6.1188 1.7972
quadrupole: 16.2615 -6.5130 -9.7485 -2.0265 6.1188 1.7972
hfenergy: -1275.8677128 hartree
pointgroup: C01 [X(C12H12F1N3O2S1)]
dipole: 3.1375504 -0.0761176 -0.4422823 debye
polarizability: 307.1236347|-12.2577677|187.4725331|-5.277978|-10.0080675|81.8833014 unknown
InChI: InChI=1S/C12H12FN3O2S/c1-16(18-2)12(17)14-11-7-10(15-19-11)8-3-5-9(13)6-4-8/h3-7,14H,1-2H3
charge 0 multiplicity 1
31 atoms
S  0.718951 -2.62092 0.375455
F  -6.397576 1.339657 -0.092374
O  5.160144 -0.430822 0.096849
O  2.3330 1.804168 -0.134904
N  2.563369 -0.543405 0.100843
N  -1.035822 -2.199006 0.330376
N  4.45148 0.818443 -0.228315
C  -2.505411 -0.270669 0.093257
C  -1.140315 -0.851929 0.160091
C  0.082761 -0.087833 0.060251
C  1.213388 -0.886884 0.156524
C  -2.702143 1.122485 -0.106934
C  -3.64427 -1.112712 0.229559
C  -4.001027 1.669426 -0.170371
C  -4.947559 -0.583731 0.1687
C  3.04724 0.763182 -0.073603
C  -5.095933 0.801003 -0.03068
C  5.203847 2.034454 0.111132
C  5.910936 -0.895425 -1.09881
H  0.15268 0.989935 -0.066521
H  -1.84478 1.793084 -0.216162
H  -3.48648 -2.184131 0.383299
H  3.288477 -1.254321 0.243357
H  -4.165435 2.739704 -0.323731
H  -5.830876 -1.220298 0.272522
H  4.530523 2.889504 -0.056189
H  6.083709 2.133584 -0.546257
H  5.52914 2.022608 1.168572
H  6.371259 -1.844439 -0.780451
H  6.696745 -0.168339 -1.369607
H  5.228677 -1.053374 -1.95238
