program: Gaussian 09
title: 000175691
version: EM64L-G09RevD.01
frameworkgroup: C1[X(C17H19N7O3)]
method: RPBEPBE
basis: SDD
operation: Freq
keyword: #p
keyword: freq=noraman
keyword: PBEPBE/SDD
title: #p freq=noraman PBEPBE/SDD
converged: YES YES NO NO
title: Mulliken charges:
elementType: O O O N N N N N N N C C C C C C C C C C C C C C C C C H H H H H H H H H H H H H H H H H H H
charge: -0.262288 -0.415112 -0.230576 -0.043120 -0.003427 -0.047265 -0.636953 -0.096920 -0.616936 -0.582896 -0.392832 -0.362367 -0.308841 -0.482733 0.320783 0.352660 -0.030637 -0.423078 -0.366510 -0.362502 -0.384558 0.051956 -0.115104 0.175251 -0.029064 0.139035 -0.046766 0.214312 0.214675 0.216732 0.215995 0.208068 0.210080 0.255076 0.254526 0.272914 0.255823 0.250219 0.251545 0.339930 0.331962 0.324957 0.347766 0.378174 0.326271 0.331776
chargesum: 0.00000
title: Mulliken charges with hydrogens summed into heavy atoms:
elementType: O O O N N N N N N N C C C C C C C C C C C C C C C C C
charge: -0.262288 -0.036938 -0.230576 -0.043120 -0.003427 -0.047265 0.034940 -0.096920 0.055787 0.075150 0.036155 0.070359 0.109307 0.026868 0.320783 0.352660 -0.030637 -0.150164 -0.110687 -0.112283 -0.133013 0.051956 -0.115104 0.175251 -0.029064 0.139035 -0.046766
polarizability: 5.09071253e+02 -1.31987865e+01 2.39112136e+02 -2.70212734e+01 -6.71247236e+00 1.32804142e+02
1716.lowfreq: -9.8547 -3.0197 -2.3624 -0.0008 0.0002 0.0015 10.7249 17.2974 23.1882
frequency: 10.7142 17.2832 23.1674 33.2680 44.8892 48.1408 64.0305 79.2919 98.6207 114.7599 121.2086 129.7292 143.1357 149.2065 178.5467 207.6131 222.0525 249.3549 262.3471 280.1828 282.7697 301.6794 340.7461 391.4128 401.5037 409.9031 422.6973 442.1746 461.5485 465.5580 472.7885 479.5142 502.9894 508.0513 512.4605 528.5851 536.5890 553.2819 558.4689 580.2498 583.6300 595.6338 613.9649 630.7343 639.4810 641.7573 661.8389 669.4740 714.8396 727.9758 739.0774 756.7383 762.4739 788.0980 804.7186 810.9316 812.1634 826.8042 845.0605 859.5999 916.3147 920.3406 956.4998 968.8461 971.7468 985.7891 1005.7105 1021.5599 1033.4550 1054.2773 1061.9011 1076.1553 1104.9509 1108.7062 1117.8539 1131.8180 1160.1425 1178.1336 1180.7800 1226.2110 1231.1901 1233.7079 1240.3563 1271.9850 1287.6435 1290.2470 1291.6786 1300.6455 1318.3722 1333.7396 1354.2909 1361.1726 1377.2900 1386.6227 1406.6205 1413.8183 1422.0375 1438.2779 1455.8697 1468.0092 1470.4272 1475.0885 1487.2923 1500.0730 1508.8466 1533.3352 1555.3657 1570.4597 1593.6750 1606.4109 1617.0778 1619.3677 1668.7571 2947.6921 2987.5081 2990.8195 2999.5597 3005.0133 3029.1450 3047.2684 3070.2391 3131.4679 3148.8808 3163.8004 3170.6843 3512.3831 3524.9098 3528.4671 3558.4633 3685.5932 3688.5800 3720.6367
redmass: 7.3773 9.8280 6.9762 5.0102 3.2662 4.6473 2.5305 3.4944 5.5528 4.5055 3.9155 3.9043 4.9689 2.6387 6.7569 6.1817 5.4281 5.2634 5.8947 5.2570 8.7467 2.9889 4.1094 4.4325 4.5682 2.7911 4.4592 4.5381 1.3773 1.7980 3.4291 1.8000 1.8280 3.5245 4.1990 1.8093 2.1387 1.0709 5.1881 1.5023 5.0314 4.5275 1.0748 6.5789 5.5870 1.3030 7.6182 8.4494 6.6793 5.4550 1.1409 5.9583 8.5251 7.2516 1.2952 5.7174 11.2277 1.2841 1.7207 4.6524 3.0448 1.3181 1.3396 7.0496 1.3607 3.8312 2.4191 3.3896 1.8824 4.1086 2.9672 2.4681 1.6537 2.8430 1.3509 2.1651 1.2266 3.0753 1.3683 2.7036 5.1377 1.3690 1.2717 1.4958 1.0672 5.7723 1.1308 1.5426 3.4872 1.5872 8.0878 4.7471 1.8035 1.5452 6.0247 6.5173 4.1435 1.0847 4.8413 1.0857 3.3160 1.1238 1.1514 2.5278 3.3235 3.4319 3.4731 6.5458 1.5435 1.4949 2.6425 3.8527 8.2746 1.0551 1.0610 1.0603 1.0589 1.1059 1.0993 1.1027 1.1043 1.0888 1.0877 1.0941 1.0971 1.0640 1.0443 1.0445 1.0439 1.1048 1.1048 1.1060
irintensity: 0.0070 1.0058 0.0237 0.2163 1.5250 0.2584 0.2992 0.5340 2.7419 5.5192 2.5728 0.7389 1.6703 3.3677 0.4857 6.2682 4.0454 2.8509 5.3053 3.5570 0.4769 12.7202 3.6474 1.4513 2.3406 11.6418 7.3178 5.9973 45.2899 315.7954 6.7677 58.0791 27.5722 18.6745 7.0220 157.4904 157.7028 0.1686 15.5033 78.6413 18.4866 5.6492 43.5990 4.1944 26.0818 132.2294 1.4353 12.1026 4.6296 6.3821 18.6571 6.2833 8.8556 11.8844 0.9095 5.9021 10.4606 7.7479 53.6503 0.3649 5.0533 0.9596 1.7358 101.6812 2.6257 7.8442 8.1059 311.0200 8.8429 5.4234 14.6517 57.5331 1.6612 21.7137 14.5652 0.4761 0.4567 20.8767 200.1427 200.9374 157.7701 13.3940 0.5235 41.7462 0.3249 1.6299 0.7863 17.4381 8.2188 48.3131 158.1152 94.3111 16.5025 46.6385 94.7812 60.7318 15.6113 27.5308 179.9068 0.3489 187.0041 39.0493 67.4307 321.0896 174.2946 32.5873 716.0315 12.7191 679.6231 334.5131 311.4661 52.1696 206.4056 38.2547 3.4878 4.6635 47.9185 20.9087 0.6949 0.7007 76.9946 10.1890 5.9524 18.3969 6.6032 23.0695 84.1286 67.1490 212.5218 53.9770 67.6587 46.5862
temp: 298.150 k
press: 1.00000 atm
elementType: 8 8 8 7 7 7 7 7 7 7 6 6 6 6 6 6 6 6 6 6 6 6 6 6 6 6 6 1 1 1 1 1 1 1 1 1 1 1 1 1 1 1 1 1 1 1
symmnumber: 1
zpe: 934867.0 jmol-1
zpe.correction: 0.356072 hartree
zpe.thermalcorrener: 0.381281 hartree
zpe.thermalcorrenthalpy: 0.382225 hartree
zpe.thermalcorrgfe: 0.297142 hartree
zpe.sumelectzpe: -1266.246204 hartree
zpe.sumelectthermal: -1266.220995 hartree
zpe.sumelectthermalent: -1266.220051 hartree
zpe.sumelectthermalfe: -1266.305133 hartree
dipole: -4.0140 -1.7461 0.5743
dipole: 4.4149
quadrupole: -136.1961 -148.1728 -159.9786
quadrupole: -8.0856 -5.6064 5.1196
quadrupole: 11.9197 -0.0570 -11.8627 -8.0856 -5.6064 5.1196
hfenergy: -1266.6022757 hartree
pointgroup: C01 [X(C17H19N7O3)]
dipole: 1.579043 -0.6632046 -0.2895079 debye
polarizability: 509.2606585|15.3800886|236.6422129|-24.4751005|17.3053042|135.0846589 unknown
InChI: InChI=1S/C17H19N7O3/c18-14-12(21-13-15(19)23-17(20)24-16(13)22-14)9-4-6-10(7-5-9)27-8-2-1-3-11(25)26/h4-7,25H,1-3,8,18-20H2
charge 0 multiplicity 1
46 atoms
O  3.340956 -0.82402 -0.720631
O  10.643711 -0.502763 0.23114
O  9.40272 1.162684 1.269318
N  -3.055546 -0.645183 -0.110624
N  -4.152544 1.989857 -0.032956
N  -6.316912 1.086941 0.33529
N  -2.05921 2.888149 -0.465837
N  -6.633206 -1.37179 0.376991
N  -4.79491 -2.82222 0.116996
N  -8.411608 0.111132 0.650008
C  5.72739 -0.679314 -0.385439
C  6.905769 0.068033 0.27675
C  4.383532 -0.035486 -0.037479
C  8.257071 -0.586225 -0.065962
C  -0.77542 0.169907 -0.336581
C  2.005167 -0.43776 -0.547208
C  -2.233888 0.424229 -0.211007
C  0.20064 0.96388 0.323529
C  -0.321374 -0.949348 -1.093815
C  1.579035 0.670662 0.225967
C  1.044289 -1.248988 -1.20494
C  -2.827389 1.767117 -0.220376
C  -4.400025 -0.429773 0.046041
C  9.436131 0.135889 0.556932
C  -4.972507 0.892813 0.126765
C  -5.305796 -1.555356 0.181749
C  -7.061619 -0.051759 0.445132
H  5.8450 -0.684584 -1.48619
H  5.709265 -1.736733 -0.058268
H  6.920539 1.126034 -0.048333
H  6.778239 0.087106 1.376219
H  4.343851 1.017698 -0.386596
H  4.205878 -0.053576 1.058198
H  8.288016 -1.641413 0.268968
H  8.419357 -0.617606 -1.161329
H  -0.113993 1.789679 0.971825
H  -1.065618 -1.57897 -1.591396
H  2.297125 1.296263 0.763914
H  1.394579 -2.102756 -1.793064
H  -1.086149 2.8146 -0.750778
H  -2.549294 3.780139 -0.519914
H  -5.41255 -3.622362 0.227578
H  -3.787378 -2.926277 -0.001016
H  11.399694 -0.007345 0.64928
H  -9.003493 -0.709927 0.73774
H  -8.785927 1.054323 0.708809
