program: Gaussian 09
title: 000175650
version: EM64L-G09RevD.01
frameworkgroup: C1[X(C11H19N3OS)]
method: RPBEPBE
basis: SDD
operation: Freq
keyword: #p
keyword: freq=noraman
keyword: PBEPBE/SDD
title: #p freq=noraman PBEPBE/SDD
converged: YES YES NO NO
title: Mulliken charges:
elementType: S O N N N C C C C C C C C C C C H H H H H H H H H H H H H H H H H H H
charge: 0.307076 -0.302534 -0.395638 -0.398358 -0.169694 0.203739 0.254356 -0.697893 -0.698241 -0.706975 -0.306512 -0.186892 -0.391461 0.301735 -0.627073 -0.644126 0.209665 0.222988 0.224528 0.222202 0.209648 0.224526 0.196076 0.227922 0.226157 0.317989 0.313940 0.234264 0.212914 0.228562 0.287086 0.222925 0.222098 0.229768 0.225235
chargesum: 0.00000
title: Mulliken charges with hydrogens summed into heavy atoms:
elementType: S O N N N C C C C C C C C C C C
charge: 0.307076 -0.302534 -0.395638 -0.084419 -0.169694 0.203739 0.254356 -0.040711 -0.041865 -0.056820 0.011477 -0.186892 0.055717 0.301735 0.111499 0.032974
polarizability: 2.36053474e+02 2.75953971e+00 1.62183309e+02 -2.74082241e+00 -2.20519193e+00 1.04964012e+02
1716.lowfreq: -3.6676 -0.0014 0.0009 0.0012 8.1397 10.0984 28.6468 30.1279 57.9999
frequency: 28.1438 30.0294 57.9181 73.0173 84.7110 99.9806 115.8249 138.1061 169.2875 184.9436 194.1784 210.8799 237.4525 251.7510 259.4999 267.4619 278.5482 294.1463 317.1577 341.5372 371.8526 395.7629 405.6711 438.4859 474.2784 501.6045 514.6845 538.5906 585.7638 600.4303 644.7542 693.8833 703.5013 718.8809 792.2200 805.2814 845.5710 886.0860 924.6224 933.3137 937.2532 940.6063 950.7836 1005.9821 1021.9605 1024.2445 1072.0950 1086.1345 1105.9994 1125.8545 1147.4843 1175.1860 1207.5856 1219.8831 1233.2377 1242.1925 1265.2764 1337.1268 1367.9694 1375.3778 1379.0190 1380.2910 1395.8504 1397.5905 1409.2311 1423.9292 1453.8906 1463.1669 1464.4887 1469.3309 1472.0270 1475.0790 1478.8443 1482.6846 1488.7549 1490.0908 1495.9489 1513.3728 1573.2087 1629.4053 2969.0352 2974.8659 2977.4727 2977.7612 2986.8691 2987.9792 3042.6987 3044.6852 3071.1231 3074.4104 3079.1304 3084.1605 3084.4522 3085.7156 3092.2354 3097.4046 3120.8788 3232.2031 3561.2276
redmass: 3.6720 3.1215 4.3525 4.1323 4.1279 3.8155 2.6811 1.3209 2.1044 1.6577 1.3643 1.3220 1.7708 1.2850 1.3151 2.9284 4.9282 3.4323 3.1459 2.9727 3.6548 2.9341 3.2598 2.8663 3.2391 1.3544 3.4830 5.7219 4.5112 5.8109 8.5236 6.1398 7.3305 5.7781 1.1780 3.3072 3.6830 1.3438 1.7277 2.9589 1.8191 2.6267 1.2056 2.8619 1.4019 1.4028 1.9482 1.5423 1.7975 1.3238 2.4774 2.2803 2.8915 2.9755 3.5961 2.2907 1.5690 1.3903 3.4913 1.1953 1.9493 1.2958 1.2166 3.2737 1.4886 1.2061 1.0492 1.0542 1.0488 1.0672 1.3679 1.0532 1.0591 1.0690 1.2542 1.0979 1.0847 1.1626 5.7880 5.3208 1.0369 1.0344 1.0350 1.0651 1.0362 1.0364 1.0978 1.1015 1.1001 1.0997 1.1008 1.0992 1.0993 1.0998 1.1006 1.0994 1.0967 1.0949 1.0759
irintensity: 1.8953 0.0645 0.1994 1.2810 8.7427 3.3970 0.2426 0.9267 2.2053 1.4538 1.4946 0.5826 1.3458 0.6723 0.4327 0.4031 2.1645 1.3441 1.5037 4.3888 9.8433 0.7407 7.1538 7.5717 9.5902 64.2740 3.0506 12.6243 1.3149 4.1046 7.3869 7.3024 12.4219 3.9968 13.7593 4.5010 6.4762 33.6104 2.8765 14.0995 11.2312 2.4735 0.5076 17.9373 0.9833 0.6093 8.4624 51.7161 0.0211 9.3487 218.9621 89.1883 8.7004 5.5996 64.1298 38.3958 36.9762 57.6635 0.5775 18.6923 82.0789 58.5821 24.7182 2.4453 9.3229 57.4894 0.1252 7.9618 1.1219 63.3374 280.4986 14.6706 33.9924 1.6948 187.0574 74.5328 29.1795 79.1434 193.7245 358.1847 87.2757 29.6955 27.1748 37.6411 39.9784 16.5469 23.7122 28.5055 6.0328 34.8646 8.4650 74.3794 62.9810 41.9473 33.6266 32.5143 0.8913 3.5401 28.5994
temp: 298.150 k
press: 1.00000 atm
elementType: 16 8 7 7 7 6 6 6 6 6 6 6 6 6 6 6 1 1 1 1 1 1 1 1 1 1 1 1 1 1 1 1 1 1 1
symmnumber: 1
zpe: 760421.6 jmol-1
zpe.correction: 0.289629 hartree
zpe.thermalcorrener: 0.308450 hartree
zpe.thermalcorrenthalpy: 0.309394 hartree
zpe.thermalcorrgfe: 0.242071 hartree
zpe.sumelectzpe: -1066.854319 hartree
zpe.sumelectthermal: -1066.835498 hartree
zpe.sumelectthermalent: -1066.834554 hartree
zpe.sumelectthermalfe: -1066.901877 hartree
dipole: 5.7952 0.2728 -0.0828
dipole: 5.8022
quadrupole: -80.5860 -110.2767 -106.7552
quadrupole: 11.3618 -1.7195 -0.0983
quadrupole: 18.6200 -11.0707 -7.5493 11.3618 -1.7195 -0.0983
hfenergy: -1067.143948 hartree
pointgroup: C01 [X(C11H19N3O1S1)]
dipole: -2.2788841 0.1298878 0.028698 debye
polarizability: 236.0026331|-3.4780004|162.1907736|-2.4529651|2.8481224|105.0073882 unknown
InChI: InChI=1S/C11H19N3OS/c1-6-14(5)10(15)12-9-7-8(13-16-9)11(2,3)4/h7,12H,6H2,1-5H3
charge 0 multiplicity 1
35 atoms
S  0.735521 2.42118 0.246745
O  -1.500759 -1.693847 -0.040682
N  2.42192 1.729555 0.127837
N  -1.410681 0.644672 0.165774
N  -3.49636 -0.488193 0.215374
C  3.584504 -0.454495 -0.106537
C  2.304635 0.386576 0.016129
C  3.545236 -1.219128 -1.462793
C  3.621901 -1.476735 1.067594
C  4.848825 0.438418 -0.05417
C  0.977729 -0.189687 0.011742
C  -0.01724 0.770131 0.127907
C  -4.239201 0.780879 0.375083
C  -2.107526 -0.589729 0.101545
C  -4.291505 -1.721698 0.082639
C  -4.497033 1.528856 -0.955383
H  4.449125 -1.848775 -1.563189
H  2.659354 -1.8753 -1.535578
H  3.519683 -0.51194 -2.311507
H  2.743851 -2.147115 1.054311
H  4.531755 -2.101082 0.990484
H  3.64132 -0.955602 2.041828
H  5.751034 -0.193593 -0.154279
H  4.844823 1.1829 -0.868568
H  4.907816 0.992163 0.898562
H  0.752448 -1.250224 -0.073959
H  -1.949774 1.507856 0.226546
H  -5.207676 0.530648 0.844666
H  -3.722422 1.437116 1.104257
H  -4.868986 -1.915321 1.00656
H  -3.601971 -2.561227 -0.090706
H  -4.994252 -1.649744 -0.76959
H  -3.555597 1.816651 -1.457156
H  -5.064899 0.891018 -1.655101
H  -5.0853 2.446816 -0.774085
