program: Gaussian 09
title: 000175577
version: EM64L-G09RevD.01
frameworkgroup: C1[X(C11H20O)]
method: RPBEPBE
basis: SDD
operation: Freq
keyword: #pfreq=noraman
keyword: PBEPBE/SDD
title: #p freq=noraman PBEPBE/SDD
converged: YES YES NO NO
title: Mulliken charges:
elementType: O C C C C C C C C C C C H H H H H H H H H H H H H H H H H H H H
charge: -0.184681 0.036602 0.015962 -0.480344 -0.479766 -0.461344 -0.456707 -0.038707 -0.485878 -0.739117 -0.739274 -0.074204 0.186724 0.193110 0.193207 0.212584 0.216771 0.189930 0.196988 0.195579 0.213119 0.195762 0.193810 0.236601 0.221665 0.206392 0.210597 0.224763 0.206636 0.209932 0.225879 0.157409
chargesum: 0.00000
title: Mulliken charges with hydrogens summed into heavy atoms:
elementType: O C C C C C C C C C C C
charge: -0.184681 0.223326 0.209072 -0.074553 -0.073065 -0.068777 -0.047826 0.155103 -0.027612 -0.097365 -0.096826 0.083206
polarizability: 1.45703459e+02 -4.20506247e+00 1.11102994e+02 -2.09269067e+00 3.88295771e-01 9.72508644e+01
1716.lowfreq: -31.2085 -12.7511 -6.9470 -0.0007 -0.0006 0.0005 33.6679 45.9790 52.8593
frequency: 33.3513 45.6303 52.7494 90.7690 131.0189 173.8461 193.8611 209.9651 233.6739 240.4162 274.4760 339.2451 369.9301 393.0739 401.1168 427.1096 453.9320 474.3199 488.1823 575.2120 738.3996 780.0913 783.6702 841.6229 867.8663 892.3463 910.6809 927.2278 932.6764 955.2711 974.2523 986.9055 1021.0951 1038.1697 1061.6855 1073.1502 1097.1342 1103.9777 1114.0719 1152.9932 1161.3271 1169.5016 1190.1416 1215.0651 1235.9537 1245.6116 1258.9864 1280.4686 1291.2298 1309.6591 1314.8197 1316.9814 1328.5506 1329.6168 1338.9365 1342.8256 1368.4237 1377.5928 1387.7344 1394.6869 1430.8191 1456.9479 1458.3781 1465.5574 1467.9934 1470.7183 1477.4639 1482.7344 1496.1431 1646.6509 2834.3216 2919.7245 2932.7151 2944.0474 2949.7323 2952.3683 2955.1764 2960.6167 2961.2069 2968.5175 2972.4324 3012.4913 3019.8641 3034.3602 3043.4978 3050.4981 3057.4520 3064.9119 3074.4510 3079.7915
redmass: 3.0885 4.0290 4.1400 2.4710 2.8454 1.8301 1.4978 1.6968 1.7923 1.4955 2.7326 2.0876 2.1773 2.7752 2.3399 2.1759 2.9984 2.5334 2.2712 2.3980 1.8112 1.6082 1.7631 2.3258 2.3021 1.3678 1.1712 1.7608 2.0644 1.4385 1.7810 1.9743 2.5111 2.1565 1.1148 1.7599 2.7828 2.7571 2.4156 1.9274 2.0721 1.7356 1.6085 1.3275 1.3983 1.2654 1.2344 1.2767 1.2999 1.3835 1.3218 1.3070 1.4004 1.4353 1.5496 1.6225 1.5062 1.2132 1.2071 1.2061 1.0888 1.0818 1.0872 1.0792 1.0578 1.0945 1.0474 1.0581 1.0476 7.9973 1.0839 1.0801 1.0810 1.0820 1.0644 1.0665 1.0593 1.0616 1.0688 1.0366 1.0369 1.0997 1.0994 1.0974 1.0961 1.0950 1.0988 1.0980 1.0986 1.0978
irintensity: 1.4009 5.0194 2.0310 2.7464 2.2956 0.4824 0.3053 0.2011 0.3244 0.5960 0.2918 0.1051 1.7465 0.0248 2.4008 0.8599 0.0239 2.7849 5.6474 4.0227 1.7330 0.4869 0.6765 2.1158 3.2889 9.7289 4.7553 2.7295 3.2294 1.0162 13.8475 2.5895 19.4170 22.7400 0.1198 2.5394 0.6258 0.1488 0.3783 10.0723 0.5551 7.1039 11.8383 2.3620 0.9242 0.8834 6.8254 1.2690 1.6254 1.3404 0.9004 0.0583 1.8305 2.2331 0.9909 0.2371 2.7497 19.8251 0.2614 17.9148 12.2052 2.7371 9.7801 20.9969 0.9666 0.2844 4.1770 6.1347 25.6846 176.0607 109.6211 3.8054 14.1966 12.5719 18.4783 20.8328 24.5121 60.9207 69.9543 29.0959 34.3606 51.7125 50.5449 41.8387 58.6756 42.7523 1.3862 99.4845 43.1741 45.5074
temp: 298.150 k
press: 1.00000 atm
elementType: 8 6 6 6 6 6 6 6 6 6 6 6 1 1 1 1 1 1 1 1 1 1 1 1 1 1 1 1 1 1 1 1
symmnumber: 1
zpe: 749788.6 jmol-1
zpe.correction: 0.285579 hartree
zpe.thermalcorrener: 0.299329 hartree
zpe.thermalcorrenthalpy: 0.300273 hartree
zpe.thermalcorrgfe: 0.244518 hartree
zpe.sumelectzpe: -505.406808 hartree
zpe.sumelectthermal: -505.393058 hartree
zpe.sumelectthermalent: -505.392114 hartree
zpe.sumelectthermalfe: -505.447869 hartree
dipole: -2.9610 1.7049 1.0674
dipole: 3.5796
quadrupole: -97.1690 -76.8592 -74.2923
quadrupole: 8.5291 4.8678 -0.7021
quadrupole: -14.3956 5.9143 8.4812 8.5291 4.8678 -0.7021
hfenergy: -505.6923874 hartree
pointgroup: C01 [X(C11H20O1)]
dipole: 1.1844301 -0.6585384 0.3831488 debye
polarizability: 145.9099343|-3.5612862|110.9564556|1.2302895|0.0897144|97.1909271 unknown
InChI: InChI=1S/C11H20O/c1-9(2)11-5-3-10(4-6-11)7-8-12/h8-11H,3-7H2,1-2H3
charge 0 multiplicity 1
32 atoms
O  -4.763934 0.789508 -0.150292
C  1.558986 0.021723 -0.215954
C  -1.39374 -0.511838 0.281113
C  1.023139 -1.369586 0.219696
C  0.581482 1.125532 0.272829
C  -0.437137 -1.616823 -0.225666
C  -0.877111 0.873644 -0.174982
C  3.021715 0.268654 0.277465
C  -2.84951 -0.765486 -0.193842
C  4.001247 -0.822364 -0.225821
C  3.55467 1.663128 -0.139368
C  -3.843483 0.184294 0.44885
H  1.573062 0.048292 -1.330257
H  -1.38164 -0.535112 1.394567
H  1.088223 -1.445108 1.326751
H  1.662654 -2.172177 -0.191788
H  0.904871 2.115269 -0.098675
H  0.622986 1.172052 1.382678
H  -0.482619 -1.647013 -1.335042
H  -0.777205 -2.608968 0.134132
H  -1.533366 1.677692 0.214898
H  -0.938977 0.92811 -1.282613
H  3.006529 0.227769 1.389576
H  -2.934531 -0.69765 -1.294357
H  -3.147159 -1.796654 0.100607
H  3.999392 -0.868391 -1.332671
H  5.033973 -0.595583 0.098445
H  3.747682 -1.826536 0.156734
H  3.503483 1.78955 -1.238732
H  4.612217 1.779468 0.162591
H  2.986297 2.487951 0.324686
H  -3.706599 0.310352 1.557641
