program: Gaussian 09
title: 000175560
version: EM64L-G09RevD.01
frameworkgroup: C1[X(C12H24O)]
method: RPBEPBE
basis: SDD
operation: Freq
keyword: #pfreq=noraman
keyword: PBEPBE/SDD
title: #p freq=noraman PBEPBE/SDD
converged: YES YES NO NO
title: Mulliken charges:
elementType: O C C C C C C C C C C C C H H H H H H H H H H H H H H H H H H H H H H H H
charge: -0.452938 0.090243 -0.360510 -0.014144 -0.401280 -0.467368 0.290190 -0.333749 -0.689699 -0.732260 -0.681983 -0.715322 -0.716169 0.209426 0.184519 0.185147 0.180528 0.209577 0.198093 0.237173 0.240342 0.234934 0.220801 0.188455 0.222059 0.209858 0.222418 0.233342 0.194693 0.215439 0.203128 0.207313 0.222243 0.205481 0.209107 0.210421 0.340491
chargesum: 0.00000
title: Mulliken charges with hydrogens summed into heavy atoms:
elementType: O C C C C C C C C C C C C
charge: -0.112447 0.090243 0.033435 0.171004 -0.011175 -0.032101 0.290190 -0.093407 -0.045510 -0.077926 -0.038508 -0.082638 -0.091160
polarizability: 1.61577174e+02 8.79313738e+00 1.25813397e+02 -7.17944923e+00 -2.95021372e+00 1.19766830e+02
1716.lowfreq: -30.6579 -29.9569 -17.4851 -9.2313 -0.0004 -0.0004 0.0001 28.9328 31.8427
frequency: -30.2830 28.5018 31.7009 45.4289 98.8041 131.4708 137.3356 164.8336 188.7395 201.7147 207.0983 222.9038 238.3957 251.8284 270.8513 282.0484 310.0313 325.4703 352.5009 356.5644 369.4858 403.6671 429.8840 458.4461 493.7649 535.0059 637.7637 725.7418 748.7451 794.2602 810.1761 842.5292 869.2963 907.4324 911.1642 911.5257 930.5816 940.8699 951.8060 959.8306 991.3323 1013.8846 1015.9911 1030.1702 1058.7798 1082.4640 1121.3811 1156.0013 1172.7595 1189.2287 1199.7985 1205.2611 1210.0247 1220.7809 1261.8178 1275.9957 1280.8731 1295.6895 1319.8978 1328.5646 1339.6183 1352.7319 1373.1792 1377.8079 1378.5793 1389.9764 1404.9401 1454.5538 1457.6276 1459.2708 1463.9608 1465.5347 1468.6325 1469.1896 1473.3531 1478.3123 1480.0423 1481.8786 1488.4801 1493.1774 1706.0300 2946.1725 2948.1348 2955.6887 2961.7570 2963.2727 2965.7479 2967.8591 2971.9237 2980.0518 3000.7542 3028.0950 3049.6048 3052.2128 3054.8145 3061.4196 3062.1589 3064.5557 3070.9752 3074.4956 3079.6927 3084.5516 3087.4719 3139.1490 3594.3444
redmass: 2.9752 2.5247 3.4712 3.2964 2.3362 1.9258 2.0169 1.7639 1.8053 1.4028 1.1069 1.0484 1.1358 1.8318 1.1883 2.7193 2.0504 2.9453 2.2435 2.6955 2.3995 2.4781 2.0233 2.7819 2.6242 2.6914 4.4581 2.7829 1.3424 1.5663 1.9345 2.3358 2.1128 1.3960 1.7764 1.3895 1.6135 1.2142 1.4334 1.8085 1.9192 1.3860 1.5961 1.7284 2.0377 2.3571 1.9475 2.1175 1.7338 1.4674 2.5365 1.6559 1.3654 2.8400 1.5827 1.2453 1.6891 1.3993 1.4064 1.4516 1.4842 1.5306 1.2190 1.1885 1.2086 1.2184 1.1998 1.0720 1.0528 1.0474 1.0764 1.0551 1.0471 1.0699 1.0823 1.0527 1.0524 1.0532 1.0507 1.0646 7.0102 1.0709 1.0680 1.0674 1.0644 1.0363 1.0373 1.0365 1.0359 1.0357 1.0965 1.1015 1.0936 1.0963 1.0993 1.0981 1.0992 1.0990 1.0986 1.0994 1.1008 1.1000 1.0999 1.0895 1.0656
irintensity: 0.2940 0.0568 0.7408 1.0275 2.5571 7.3679 2.6001 3.7554 66.6801 17.7258 3.1768 5.2753 0.0384 0.6323 1.8076 4.1119 9.5224 1.2468 0.1586 0.6870 0.1347 1.0820 0.5786 0.6803 0.0804 1.5332 4.0840 13.8322 13.1097 18.3516 14.5824 23.3436 12.4849 0.6438 2.5939 7.1106 1.6739 0.6828 1.2960 3.0197 7.5896 0.6999 8.8193 16.7613 22.7078 2.0595 8.4058 0.5325 12.4950 62.6641 5.3828 57.4603 50.8084 8.6468 8.3042 5.8967 19.9223 16.4673 2.8105 3.7325 4.3524 3.7241 22.2577 18.5803 23.3000 13.5635 9.1285 1.0885 0.3454 0.4493 12.7350 0.2207 2.8116 1.4277 7.7089 15.0066 7.7674 18.6063 22.9379 24.7088 38.7784 7.9396 12.1634 26.7589 77.2996 57.6824 27.5220 33.1441 45.1010 15.3035 2.7141 70.8273 23.8607 14.2347 7.8317 38.7757 90.5251 89.2798 55.8223 27.8795 2.1751 49.1556 63.7305 13.5427 14.8649
temp: 298.150 k
press: 1.00000 atm
elementType: 8 6 6 6 6 6 6 6 6 6 6 6 6 1 1 1 1 1 1 1 1 1 1 1 1 1 1 1 1 1 1 1 1 1 1 1 1
symmnumber: 1
zpe: 870466.7 jmol-1
zpe.correction: 0.331543 hartree
zpe.thermalcorrener: 0.348393 hartree
zpe.thermalcorrenthalpy: 0.349338 hartree
zpe.thermalcorrgfe: 0.287101 hartree
zpe.sumelectzpe: -545.794376 hartree
zpe.sumelectthermal: -545.777526 hartree
zpe.sumelectthermalent: -545.776581 hartree
zpe.sumelectthermalfe: -545.838818 hartree
dipole: 1.8472 1.4019 0.3648
dipole: 2.3475
quadrupole: -77.9721 -86.3285 -82.3129
quadrupole: 3.8521 -2.0762 -1.4550
quadrupole: 4.2324 -4.1240 -0.1084 3.8521 -2.0762 -1.4550
hfenergy: -546.1259191 hartree
pointgroup: C01 [X(C12H24O1)]
dipole: 0.7238721 0.5282513 0.22344 debye
polarizability: 161.2306988|10.1913427|126.814227|-6.1145474|-1.9940133|119.1124753 unknown
InChI: InChI=1S/C12H24O/c1-10(2)8-6-7-9-11(13)12(3,4)5/h9-10,13H,6-8H2,1-5H3
charge 0 multiplicity 1
37 atoms
O  1.714713 -0.546295 -1.765542
C  2.866872 0.473853 0.208575
C  -2.231659 0.01384 -0.204144
C  -3.557485 0.532616 0.413673
C  -1.807269 -1.397355 0.261008
C  -0.398018 -1.807735 -0.250546
C  1.711705 -0.374198 -0.35041
C  0.716503 -0.977902 0.352926
C  2.819072 1.901815 -0.422256
C  2.772829 0.614903 1.747234
C  4.228338 -0.200571 -0.147991
C  -4.773732 -0.334703 0.006556
C  -3.795723 2.010651 0.021317
H  -1.416732 0.723762 0.045569
H  -2.321024 0.021972 -1.31158
H  -3.456003 0.482363 1.519967
H  -1.819555 -1.435746 1.371481
H  -2.54264 -2.14882 -0.088176
H  -0.23307 -2.878191 -0.002353
H  -0.359796 -1.730365 -1.352377
H  0.715938 -0.868553 1.442986
H  1.849345 2.389217 -0.216787
H  3.624663 2.529379 0.001068
H  2.964137 1.890082 -1.520943
H  1.831565 1.107861 2.050456
H  3.614677 1.228625 2.11711
H  2.82595 -0.370004 2.244943
H  4.285747 -1.214374 0.286607
H  4.378462 -0.29646 -1.240593
H  5.066836 0.400195 0.250441
H  -4.890355 -0.344005 -1.095015
H  -5.7091 0.065305 0.441706
H  -4.666724 -1.380948 0.345173
H  -3.899155 2.109221 -1.077003
H  -4.719153 2.407478 0.483821
H  -2.951623 2.651784 0.33864
H  2.413862 0.017503 -2.176941
