program: Gaussian 09
title: 000016384
version: EM64L-G09RevD.01
frameworkgroup: C1[X(C8H14)]
method: RPBEPBE
basis: SDD
operation: Freq
keyword: #p
keyword: freq=noraman
keyword: PBEPBE/SDD
title: #p freq=noraman PBEPBE/SDD
converged: YES YES NO NO
title: Mulliken charges:
elementType: C C C C C C C C H H H H H H H H H H H H H H
charge: -0.534977 0.456896 -0.430595 -0.317038 -0.686029 -0.667634 -0.206406 -0.595764 0.209761 0.203940 0.207244 0.207390 0.210827 0.231684 0.213258 0.221064 0.216501 0.212186 0.224558 0.201092 0.207048 0.214995
chargesum: 0.00000
title: Mulliken charges with hydrogens summed into heavy atoms:
elementType: C C C C C C C C
charge: -0.121277 0.456896 -0.015961 -0.106211 -0.020022 -0.014389 -0.005314 -0.173722
polarizability: 1.23537152e+02 -1.86568193e+01 9.15352843e+01 6.83642348e+00 2.35228298e-01 6.13728191e+01
1716.lowfreq: -16.5901 -10.0569 -0.0006 -0.0005 -0.0004 7.8761 35.9718 79.7737 120.1516
frequency: 35.3393 79.6109 120.1416 161.1500 185.8309 202.2061 217.5442 266.0718 328.6048 400.6040 457.8908 467.3175 573.8810 707.4401 752.8862 783.6643 803.0684 871.2311 900.8059 922.7932 950.6657 995.9754 1012.2705 1039.4218 1060.7984 1071.9891 1083.5024 1137.1667 1229.7813 1248.6270 1261.3261 1294.9055 1317.9161 1320.8309 1361.2122 1385.9794 1388.3219 1433.9417 1467.8863 1472.7464 1473.4479 1479.6933 1484.0749 1492.2074 1608.3765 1649.9699 2963.9747 2977.6759 2980.9789 2984.2372 3034.9879 3042.1895 3066.8050 3075.9087 3076.9600 3084.8667 3089.2039 3097.2801 3111.1899 3202.0485
redmass: 2.3897 2.3194 2.8033 2.0062 1.2806 1.1994 1.9252 2.1403 2.0902 2.4731 2.6125 1.8722 2.6131 2.0174 2.2331 1.2514 1.3232 1.2769 1.9525 1.3462 1.6174 1.1576 2.0228 2.0947 1.8052 1.7302 1.4668 2.1988 1.6049 1.1836 1.3447 1.3552 1.2803 1.6237 1.4481 1.2022 1.2134 1.3459 1.0726 1.0425 1.0434 1.0694 1.0674 1.0785 4.4460 5.7585 1.0665 1.0354 1.0408 1.0550 1.1003 1.0916 1.0920 1.0998 1.0972 1.1002 1.1003 1.0618 1.0886 1.1141
irintensity: 0.0711 0.3262 0.4712 0.2293 0.0310 0.0905 0.2785 0.2457 0.8768 0.5881 2.5234 9.8872 2.8948 8.4523 2.7006 0.9063 5.9360 14.0979 16.4000 75.3133 5.8046 13.3459 4.5755 2.7054 3.1705 10.8475 5.2145 2.5930 0.3511 0.6694 2.9203 0.2525 2.4558 0.1568 1.5768 10.8860 10.1465 3.9819 8.4550 13.2983 12.3140 2.8232 12.0272 16.4430 9.9034 16.0214 33.4118 49.6753 45.6844 27.6423 11.2116 1.7847 3.3666 51.4993 59.5379 47.3828 50.1150 14.2839 15.7259 30.5333
temp: 298.150 k
press: 1.00000 atm
elementType: 6 6 6 6 6 6 6 6 1 1 1 1 1 1 1 1 1 1 1 1 1 1
symmnumber: 1
zpe: 512895.4 jmol-1
zpe.correction: 0.195352 hartree
zpe.thermalcorrener: 0.205584 hartree
zpe.thermalcorrenthalpy: 0.206528 hartree
zpe.thermalcorrgfe: 0.159606 hartree
zpe.sumelectzpe: -312.567370 hartree
zpe.sumelectthermal: -312.557138 hartree
zpe.sumelectthermalent: -312.556194 hartree
zpe.sumelectthermalfe: -312.603116 hartree
dipole: 0.4690 -0.3239 0.0852
dipole: 0.5763
quadrupole: -48.6377 -49.2009 -53.6436
quadrupole: -0.0169 2.1426 1.1757
quadrupole: 1.8564 1.2932 -3.1495 -0.0169 2.1426 1.1757
hfenergy: -312.7627218 hartree
pointgroup: C01[X(C8H14)]
dipole: -0.1756646 -0.1432882 -0.0046158 debye
dipolederiv: 0.0000541 0.054627 -0.0046564 0.0233507 0.0712451 0.0230871 0.0464868 0.01069 0.1246358 0.0245542 -0.1333395 0.0637508 -0.0963432 0.0063252 -0.0326371 0.0730552 -0.0597974 -0.0584753 -0.0881639 0.0063981 -0.0177597 -0.0660191 0.0942075 0.0382265 0.0251128 0.0783419 0.1112939 0.1954903 0.164298 0.0874429 -0.0669221 -0.0081753 -0.1171141 0.2294977 -0.0450577 -0.1915743 0.0058884 0.0256774 0.0460804 0.0310575 0.0441015 -0.0190477 -0.0077103 0.0120484 0.0070559 0.0005641 -0.0055143 0.0486316 0.0640998 0.1130694 -0.003424 -0.0692826 -0.0370858 0.0351224 0.0821274 0.0903575 0.0506747 0.2196778 0.2375446 -0.0766385 -0.0190886 -0.1271355 -0.0712601 -0.1660265 -0.1772683 0.152276 -0.1621852 -0.1530805 -0.1483971 0.1599967 -0.1623816 -0.3053625 0.0173159 -0.0656209 0.0877383 -0.0133287 -0.0726321 0.1291936 0.0345118 0.0727319 -0.0110649 -0.0308797 -0.0301963 -0.0802055 -0.0623238 -0.0200431 -0.1411206 -0.0624502 -0.0858408 -0.0252838 -0.0401343 -0.0472288 -0.0439123 -0.0045125 0.008183 -0.1372613 -0.08615 -0.1202286 -0.0711961 0.0447082 -0.0300705 0.0367661 0.0262401 -0.1125263 0.1195709 0.0237698 0.081406 0.0271894 0.0454236 -0.0007928 -0.0288631 0.0048259 -0.1106221 0.095992 -0.0492192 0.1010696 0.0696363 0.0791077 -0.0418238 0.0497369 -0.0956941 -0.0330066 0.1159605 0.0468326 0.0741666 -0.0051522 -0.1469421 0.1324408 -0.0709377 0.1314629 0.0273018 0.0351336 -0.0814588 0.0490574 0.0308167 0.0364441 -0.1006771 -0.0685211 -0.0341376 -0.0218134 -0.1117228 -0.0224597 -0.1020716 -0.0086231 -0.2329675 0.0315683 -0.0614108 0.0764779 0.084699 0.0285679 -0.0813503 0.0352869 0.036556 0.0976832 0.0159422 0.0157086 -0.0540479 -0.1367415 0.1100965 0.0392277 0.0794863 0.0333748 0.0862506 -0.0430217 -0.0414059 -0.0150781 -0.0124685 -0.1253513 0.0204306 -0.1059639 -0.0634146 -0.0395636 0.1030549 -0.1025292 0.0595889 0.0204761 0.0548269 -0.0915081 0.0764953 0.0837774 0.0795359 -0.000941 -0.030157 -0.03154 -0.1007656 0.0953519 -0.0275526 0.1045952 0.1335178 -0.0504702 0.0521308 -0.0884475 0.0653509 0.0747221 0.0667068 -0.1006913 0.0701876 0.1184305 unknown
polarizability: 121.0000352|21.3705442|93.2995617|1.7112386|-5.8881397|62.1456585 unknown
InChI: InChI=1S/C8H14/c1-4-7-8(5-2)6-3/h5,7H,2,4,6H2,1,3H3
charge 0 multiplicity 1
22 atoms
C  1.539598 -0.722745 0.736997
C  0.326433 -0.023844 0.12364
C  -2.188713 -0.238686 -0.53953
C  -0.868211 -0.700356 0.039932
C  2.541941 -1.246001 -0.327676
C  -3.326035 -0.253837 0.517251
C  0.483875 1.355079 -0.378147
C  1.606391 2.127977 -0.287919
H  1.1946 -1.575935 1.351168
H  2.066461 -0.03353 1.425875
H  -2.47279 -0.920091 -1.36906
H  -2.110815 0.770731 -0.980198
H  -0.896136 -1.719655 0.459284
H  2.905748 -0.428357 -0.974014
H  3.417089 -1.719826 0.154663
H  2.058303 -1.997348 -0.977627
H  -4.292416 0.030464 0.061528
H  -3.441636 -1.260715 0.960104
H  -3.107973 0.452363 1.338197
H  -0.396022 1.8014 -0.861136
H  1.62054 3.150933 -0.679625
H  2.531865 1.772179 0.178494
