program: Gaussian 09
title: 000175611
version: EM64L-G09RevD.01
frameworkgroup: C1[X(C16H13Cl3F2N2O2)]
method: RPBEPBE
basis: SDD
operation: Freq
keyword: #p
keyword: freq=noraman
keyword: PBEPBE/SDD
title: #p freq=noraman PBEPBE/SDD
converged: YES YES NO NO
title: Mulliken charges:
elementType: Cl Cl Cl F F O O N N C C C C C C C C C C C C C C C C H H H H H H H H H H H H H
charge: -0.083224 0.042386 0.039351 -0.165144 -0.167035 -0.162600 -0.299827 -0.396127 -0.491696 -0.565995 0.590959 0.500955 0.398214 -0.432188 -0.315587 -0.280764 -0.386527 0.303397 -0.332881 -0.345755 -0.227147 -0.227016 -0.375829 -0.222232 0.191796 0.262527 0.259148 0.299518 0.294391 0.225032 0.314980 0.257582 0.264349 0.262760 0.257692 0.236881 0.238531 0.237124
chargesum: 0.00000
title: Mulliken charges with hydrogens summed into heavy atoms:
elementType: Cl Cl Cl F F O O N N C C C C C C C C C C C C C C C C
charge: -0.083224 0.042386 0.039351 -0.165144 -0.167035 -0.162600 -0.299827 -0.096610 -0.197305 -0.044320 0.590959 0.500955 0.398214 -0.207157 -0.000607 -0.280764 -0.128945 0.303397 -0.068532 -0.082995 0.030545 0.009865 -0.375829 0.016299 0.428920
polarizability: 2.97521577e+02 -7.56953849e-01 2.20623028e+02 1.01414360e+01 -2.36689907e+01 1.73196287e+02
1716.lowfreq: -3.7198 -1.7409 -0.0016 -0.0013 -0.0010 3.5048 9.8434 11.5367 21.8524
frequency: 8.4413 11.3836 21.8477 27.7176 35.4043 49.7155 64.4289 76.9055 86.6082 99.0443 123.8157 133.1068 151.1889 167.7126 182.9589 200.0536 225.4639 237.5874 265.8389 293.0301 304.9404 330.9524 338.4587 343.9852 346.2824 380.2928 415.4371 417.3101 425.0566 443.4206 449.8000 475.4013 484.1490 504.0363 529.6715 562.1533 597.1404 607.2646 625.3852 657.2875 681.4879 689.4534 704.2814 709.9298 715.4563 731.1067 760.1614 806.3933 816.3993 819.2065 841.0219 860.9465 871.0482 915.2701 927.3589 943.6329 953.4317 983.2963 986.4729 990.6843 999.0773 1001.0478 1015.9647 1017.6412 1036.9138 1095.4142 1116.9613 1126.0609 1142.9975 1173.1584 1185.5134 1206.6731 1208.6551 1214.1956 1238.8636 1274.6359 1287.5805 1294.7090 1299.7951 1326.8163 1352.2080 1370.0932 1379.1147 1412.8398 1427.3437 1443.6346 1463.3392 1481.0811 1494.2691 1510.3813 1576.0752 1599.8032 1606.3422 1617.4384 1643.7328 3019.6253 3097.1935 3109.1850 3122.2771 3136.8874 3147.2975 3163.3741 3174.4075 3176.7555 3180.7009 3198.6693 3526.5192 3541.6515
redmass: 14.3829 7.7907 8.0682 6.6417 7.6308 7.2046 9.6265 11.8804 6.6928 9.2088 5.5650 8.2850 19.3466 6.6651 4.8952 7.4005 20.3514 6.3844 7.0114 9.0186 4.4888 5.7054 9.1541 5.3757 7.2833 3.5374 3.0534 3.6073 1.6095 6.9676 4.3788 4.6631 9.1776 4.8216 4.2272 4.1240 1.9112 1.9314 6.6348 6.4075 5.5806 11.2492 7.2125 4.7102 4.2273 4.5157 1.2897 3.6027 2.9607 1.8691 3.9955 1.7606 1.4881 2.7521 3.7618 1.5793 1.4499 8.6724 1.3284 1.3445 3.4764 3.0572 4.8825 5.8299 2.2258 4.2143 1.3375 1.6114 2.5290 1.0615 1.2426 2.5088 1.6324 6.7733 1.5192 2.1751 1.3044 1.1245 1.4622 1.2903 1.4641 4.8152 4.5225 4.4368 2.0122 1.3480 2.0775 1.6257 2.3475 2.4798 6.0421 6.7762 7.2529 5.9233 4.3217 1.0632 1.0998 1.0893 1.0904 1.0864 1.0908 1.0953 1.0910 1.0999 1.0952 1.0958 1.0765 1.0772
irintensity: 0.0278 0.2812 0.5844 1.9632 0.2802 3.7241 1.2094 1.2879 11.2257 0.3829 1.4157 3.3276 1.6452 1.9688 1.7386 0.5516 0.0250 1.0093 14.2488 0.4601 11.0998 1.6433 21.3062 1.0650 21.1625 10.4698 0.2641 8.0548 17.3054 1.6498 6.4754 16.3695 4.5438 37.1263 32.1653 21.5550 52.4081 131.2310 4.7004 11.9491 3.7965 188.4045 12.9332 0.8248 3.2771 10.6998 82.4170 15.2745 1.9814 70.1399 2.1005 89.6303 2.6561 11.6869 168.0636 27.6668 1.9096 127.9300 1.7841 0.3402 13.0194 33.4489 66.9619 116.1382 3.2443 4.8202 12.1306 1.9125 83.5231 0.8548 87.7087 17.4964 229.5915 226.5964 225.5310 6.1438 13.1689 0.9941 32.7923 52.9287 8.7818 103.5430 31.1501 12.9614 16.0463 44.8455 87.4143 423.5701 16.2259 824.6427 8.5135 22.3720 3.6050 37.3290 149.0343 29.8296 1.0176 12.0182 18.0086 0.4919 7.6910 10.8408 0.5763 11.8745 0.7529 12.2357 5.3073 49.0880
temp: 298.150 k
press: 1.00000 atm
elementType: 17 17 17 9 9 8 8 7 7 6 6 6 6 6 6 6 6 6 6 6 6 6 6 6 6 1 1 1 1 1 1 1 1 1 1 1 1 1
symmnumber: 1
zpe: 691696.6 jmol-1
zpe.correction: 0.263453 hartree
zpe.thermalcorrener: 0.287676 hartree
zpe.thermalcorrenthalpy: 0.288620 hartree
zpe.thermalcorrgfe: 0.203490 hartree
zpe.sumelectzpe: -2455.514999 hartree
zpe.sumelectthermal: -2455.490777 hartree
zpe.sumelectthermalent: -2455.489832 hartree
zpe.sumelectthermalfe: -2455.574963 hartree
dipole: 5.4113 -0.6995 2.4895
dipole: 5.9974
quadrupole: -165.2538 -152.7145 -167.0972
quadrupole: -0.3064 -1.6377 -1.2532
quadrupole: -3.5653 8.9740 -5.4087 -0.3064 -1.6377 -1.2532
hfenergy: -2455.7784523 hartree
pointgroup: C01 [X(C16H13Cl3F2N2O2)]
dipole: -2.1382346 0.0730817 0.9950543 debye
polarizability: 297.684957|-2.5629312|202.9892808|-7.2270099|33.3578888|190.6666548 unknown
InChI: InChI=1S/C16H13Cl3F2N2O2/c17-13-4-2-1-3-10(13)9-22-15(24)23-11-5-7-12(8-6-11)25-16(18,19)14(20)21/h1-8,14,22-23H,9H2
charge 0 multiplicity 1
38 atoms
Cl -5.835712 1.755089 1.500488
Cl 4.886272 -2.395558 -0.299122
Cl 5.114325 -0.880331 2.331451
F  7.219887 -0.500619 -1.149388
F  7.393358 0.623145 0.832739
O  4.752767 0.364124 -0.11374
O  -1.684223 0.180602 -1.76577
N  -3.103596 1.451075 -0.414494
N  -0.820173 1.361995 0.094591
C  -4.310518 1.04237 -1.151791
C  -5.073697 -0.095289 -0.478527
C  0.560635 1.054409 0.00588
C  3.31968 0.534136 -0.037151
C  1.415297 1.601785 1.00405
C  1.116189 0.247736 -1.026044
C  -5.808103 0.086082 0.715575
C  -5.064944 -1.401603 -1.031997
C  -1.855239 0.938765 -0.763442
C  2.798902 1.34808 0.985254
C  2.502594 -0.005308 -1.046465
C  -6.519769 -0.946754 1.350379
C  -5.766658 -2.463569 -0.419225
C  5.39521 -0.710606 0.447623
C  -6.4968 -2.236395 0.769456
C  6.924987 -0.583018 0.239673
H  -3.978999 0.722472 -2.152507
H  -4.964202 1.92613 -1.262208
H  -3.242697 1.999802 0.436201
H  -1.079698 1.969636 0.874506
H  0.99804 2.233306 1.798226
H  0.458854 -0.162584 -1.793913
H  -4.486106 -1.575128 -1.94589
H  3.462201 1.773336 1.742817
H  2.941994 -0.612316 -1.842557
H  -7.076698 -0.752944 2.27145
H  -5.741978 -3.462974 -0.865564
H  -7.045237 -3.053119 1.250353
H  7.470657 -1.43546 0.675282
