program: Gaussian 09
title: 000175522
version: EM64L-G09RevD.01
frameworkgroup: C1[X(C9H18O3)]
method: RPBEPBE
basis: SDD
operation: Freq
keyword: #pfreq=noraman
keyword: PBEPBE/SDD
title: #p freq=noraman PBEPBE/SDD
converged: YES YES NO NO
title: Mulliken charges:
elementType: O O O C C C C C C C C C H H H H H H H H H H H H H H H H H H
charge: -0.275189 -0.428572 -0.200371 0.051778 -0.447232 -0.353077 -0.415188 -0.351549 -0.698339 -0.699021 -0.302712 0.165329 0.183831 0.223100 0.188032 0.240757 0.171023 0.207894 0.206314 0.198530 0.185844 0.226244 0.234164 0.211080 0.212908 0.206723 0.217258 0.221388 0.235397 0.383657
chargesum: 0.00000
title: Mulliken charges with hydrogens summed into heavy atoms:
elementType: O O O C C C C C C C C C
charge: -0.275189 -0.044915 -0.200371 0.235610 -0.036099 0.058702 -0.000980 0.032825 -0.026851 -0.062133 0.154072 0.165329
polarizability: 1.23112898e+02 1.27134354e+00 1.13679605e+02 -3.06972631e+00 -3.28906364e+00 8.72154263e+01
1716.lowfreq: -9.1205 -0.0010 -0.0003 -0.0001 8.6996 20.9547 23.0111 35.7064 55.9865
frequency: 21.8456 34.5625 55.7933 59.1612 77.5558 91.1243 121.8489 141.9298 174.3124 212.2728 231.8756 237.8628 264.8474 269.2120 336.3685 389.6284 447.9015 485.9879 515.5880 573.8966 606.0968 629.5482 730.9141 767.8554 776.8946 828.3052 865.4919 878.1912 905.5961 937.5364 975.0765 998.5320 1019.3431 1035.1079 1039.6320 1060.4165 1082.1714 1088.3629 1111.9986 1134.4422 1169.7130 1197.9024 1218.4682 1242.1171 1251.6738 1262.3283 1281.2023 1292.0377 1293.6502 1324.8912 1340.5199 1353.9753 1366.8240 1383.1213 1388.7716 1393.1304 1446.9965 1449.3884 1466.8878 1468.2602 1477.0025 1477.5160 1479.1148 1488.4309 1493.7638 1697.6555 2901.3860 2925.9688 2957.3655 2963.5427 2972.1729 2973.3055 2976.4274 2987.6922 2989.3560 3006.2686 3019.5174 3031.0272 3054.1781 3068.5242 3071.9208 3082.5015 3088.3766 3523.1227
redmass: 7.7273 5.6541 3.3268 1.6993 2.2830 2.7177 2.9260 2.3481 2.6258 1.6217 1.1562 2.7276 2.9477 2.3859 2.8410 3.4423 2.9598 2.2206 2.4780 3.8562 2.7298 1.5327 1.1133 1.6662 1.2196 2.1911 3.9029 2.0933 1.8178 1.5127 1.8605 1.9546 3.2759 1.4251 2.6045 2.2650 3.2543 2.3197 2.1046 2.1810 2.0334 1.1181 1.4384 1.2590 1.5716 1.2179 1.2109 1.1183 1.3356 1.3131 1.4818 1.5013 1.5433 1.5883 1.2302 1.2247 1.0772 1.0817 1.0755 1.0632 1.0453 1.0583 1.0528 1.0824 1.0541 9.0593 1.0823 1.0603 1.0614 1.0631 1.0363 1.0618 1.0621 1.0932 1.0383 1.0961 1.0997 1.0961 1.1019 1.1000 1.1000 1.0998 1.0998 1.0642
irintensity: 0.7952 1.0425 0.2167 0.5163 2.1717 0.1626 0.6904 1.0951 3.7913 6.3608 0.0505 0.9471 1.1211 1.4624 0.4178 4.8277 10.9031 11.2356 20.9028 22.5499 11.6373 132.1405 7.9708 5.6931 4.3356 3.8611 0.3245 16.8888 3.0425 16.3131 2.4584 6.6850 409.5994 17.4720 46.0617 17.9182 13.2006 1.0591 17.7346 11.8470 1.6030 2.6641 2.0239 4.1244 20.7529 4.4222 1.1352 3.6717 1.3873 5.9102 3.0812 2.0323 2.8978 22.7533 14.9778 20.7804 8.8289 18.1930 4.9839 0.2056 8.1126 8.1972 6.7096 15.5063 10.9932 208.2246 54.0422 38.8353 5.8820 49.7807 41.3989 67.7059 28.5805 22.1241 28.4515 16.7761 31.2577 4.9157 31.7836 82.3012 69.5387 42.7087 44.6601 26.9863
temp: 298.150 k
press: 1.00000 atm
elementType: 8 8 8 6 6 6 6 6 6 6 6 6 1 1 1 1 1 1 1 1 1 1 1 1 1 1 1 1 1 1
symmnumber: 1
zpe: 678959.0 jmol-1
zpe.correction: 0.258602 hartree
zpe.thermalcorrener: 0.273796 hartree
zpe.thermalcorrenthalpy: 0.274741 hartree
zpe.thermalcorrgfe: 0.213997 hartree
zpe.sumelectzpe: -578.421440 hartree
zpe.sumelectthermal: -578.406246 hartree
zpe.sumelectthermalent: -578.405301 hartree
zpe.sumelectthermalfe: -578.466045 hartree
dipole: 1.0184 1.7619 -1.8771
dipole: 2.7686
quadrupole: -67.9011 -74.3381 -74.7714
quadrupole: -4.6929 -0.4434 1.0598
quadrupole: 4.4358 -2.0012 -2.4345 -4.6929 -0.4434 1.0598
hfenergy: -578.680042 hartree
pointgroup: C01 [X(C9H18O3)]
dipole: 0.3923965 -0.7178947 0.7191182 debye
polarizability: 122.9998837|-1.2677942|113.8718948|3.7546286|-2.2567735|87.1361498 unknown
InChI: InChI=1S/C9H18O3/c1-3-5-6-8(4-2)12-7-9(10)11/h8,10H,3-7H2,1-2H3
charge 0 multiplicity 1
30 atoms
O  0.638787 -0.153367 -0.162997
O  3.824517 1.515023 0.350158
O  1.841477 2.355262 -0.537792
C  -0.20731 -1.139046 0.560146
C  -1.621269 -0.955558 -0.014663
C  -2.246585 0.415129 0.326317
C  0.351901 -2.577084 0.430129
C  -3.631218 0.618325 -0.328042
C  0.433413 -3.093624 -1.022566
C  -4.263961 1.982995 0.020613
C  1.938646 0.058957 0.432464
C  2.461253 1.425164 0.005198
H  -0.210278 -0.856813 1.640881
H  -1.570523 -1.069925 -1.114638
H  -2.265357 -1.773476 0.368392
H  -1.553753 1.211782 -0.005371
H  -2.345816 0.514806 1.42842
H  -0.289578 -3.247591 1.037104
H  1.358451 -2.616432 0.894009
H  -3.52676 0.52946 -1.428693
H  -4.313211 -0.198701 -0.012782
H  -0.571274 -3.225661 -1.461712
H  0.98565 -2.379132 -1.659051
H  0.950495 -4.069151 -1.065413
H  -5.248833 2.110819 -0.465567
H  -4.410353 2.085072 1.112816
H  -3.612509 2.814169 -0.308447
H  1.893595 0.051354 1.545771
H  2.680623 -0.708876 0.129655
H  4.165079 2.417622 0.10546
