program: Gaussian 09
title: 000175514
version: EM64L-G09RevD.01
frameworkgroup: C1[X(C20H26O2S)]
method: RPBEPBE
basis: SDD
operation: Freq
keyword: #p
keyword: freq=noraman
keyword: PBEPBE/SDD
title: #p freq=noraman PBEPBE/SDD
converged: YES YES NO NO
title: Mulliken charges:
elementType: S O O C C C C C C C C C C C C C C C C C C C C H H H H H H H H H H H H H H H H H H H H H H H H H H
charge: 0.057111 -0.177427 -0.231240 -0.091643 -0.165497 0.413637 -0.192882 0.323015 -0.550183 -0.544084 -0.530289 -0.458166 0.491935 -0.521891 -0.555871 -0.640455 0.039246 -0.508900 -0.641789 -0.796260 -0.545801 -0.587220 0.159832 0.218590 0.253711 0.220982 0.235194 0.220788 0.291036 0.217439 0.229397 0.218500 0.221043 0.232080 0.219041 0.225278 0.234658 0.229854 0.250810 0.249302 0.248267 0.299733 0.278005 0.230705 0.230521 0.242727 0.240628 0.252600 0.263934
chargesum: 0.00000
title: Mulliken charges with hydrogens summed into heavy atoms:
elementType: S O O C C C C C C C C C C C C C C C C C C C C
charge: 0.057111 -0.177427 -0.231240 0.126947 0.088214 0.413637 0.028100 0.323015 -0.094201 -0.253048 -0.083453 -0.018623 0.491935 -0.070770 -0.095934 -0.159791 0.039246 -0.011331 -0.064051 -0.092308 -0.052573 -0.323286 0.159832
polarizability: 2.66387710e+02 -1.95687196e+01 2.03293879e+02 -9.21434277e+00 3.92325948e+00 1.99309494e+02
1716.lowfreq: -19.8700 -4.5797 -0.0015 -0.0001 0.0010 9.2797 30.5473 42.3756 47.2607
frequency: 30.3885 42.2141 47.0928 64.6574 86.7685 125.0381 135.4815 148.2099 159.0228 178.3327 183.9932 194.2433 217.7127 231.8519 268.3808 272.9033 277.0048 302.8606 318.3232 334.4876 355.9546 369.1389 388.0015 412.3838 431.5608 441.6568 467.6747 493.2493 510.8898 534.5058 538.1838 563.5298 571.9524 575.5558 585.7079 616.2182 630.6684 659.0344 696.8317 699.5830 728.8019 769.9965 805.7428 818.5542 826.2898 844.4167 858.6350 873.2753 883.3147 901.4254 913.8457 923.4976 939.5946 953.7234 965.9518 979.0071 985.8779 1004.8151 1010.9212 1013.4747 1028.7947 1041.1749 1046.4167 1057.3601 1072.7822 1077.0262 1087.0883 1091.3199 1107.8550 1120.2009 1128.6623 1135.4241 1154.1893 1157.2307 1169.4375 1179.4842 1191.3576 1197.4778 1201.8634 1218.3611 1236.8248 1238.8462 1250.0473 1256.5111 1261.1128 1273.1654 1283.7063 1290.8440 1292.1038 1298.1080 1309.9080 1319.1985 1320.6062 1329.7210 1336.3183 1339.0546 1345.9124 1348.7158 1366.0400 1368.7606 1383.6757 1426.6188 1441.0602 1446.7757 1461.2550 1463.1210 1468.2873 1470.0046 1475.5926 1477.6609 1491.7859 1497.9262 1581.3573 1624.9899 1655.4768 2901.0829 2944.0438 2963.7357 2976.1581 2979.4922 2980.4729 2984.2031 2986.7556 2986.8942 2991.2585 2999.2309 3005.8712 3038.6363 3039.2642 3046.2572 3055.3035 3057.7395 3058.3532 3062.7553 3072.9248 3079.3700 3087.6226 3096.6900 3102.5674 3123.8987 3207.6564
redmass: 6.7783 4.6918 6.2958 5.5366 3.1968 4.2949 5.3213 2.3763 2.8915 3.0824 3.0934 2.6884 2.4410 2.1005 2.7582 2.4452 2.5164 3.0270 2.8921 2.8911 3.6232 3.0696 2.6953 3.6300 3.6519 3.5617 3.6672 4.2839 2.7668 2.5818 2.1842 3.5175 3.4031 4.0460 6.4317 4.3560 4.3606 4.1339 2.7553 3.3672 2.8636 2.0685 1.8745 1.9669 1.9854 2.0077 2.3150 1.6813 2.2275 1.1142 1.5924 1.8700 1.8760 2.2434 1.7473 2.0341 2.0830 2.0617 1.9087 1.7352 1.9998 2.8819 1.9928 2.3330 2.1277 1.4851 2.3030 2.2117 1.8332 2.2546 2.4390 1.5403 1.9839 1.5710 1.7407 2.2888 1.4827 1.6023 1.5801 1.4140 2.0122 1.7419 1.4339 1.7618 1.4113 1.8824 1.3985 1.3958 1.3188 1.3873 1.3549 1.4536 1.5075 1.5418 1.4807 1.3579 1.5068 1.4920 1.6130 1.4532 1.1849 1.0797 1.0890 1.1356 1.0732 1.0873 1.0799 1.0759 1.0842 1.0999 1.0791 1.0588 10.0205 7.5979 12.0532 1.0804 1.0814 1.0848 1.0604 1.0631 1.0625 1.0624 1.0616 1.0418 1.0581 1.0602 1.0657 1.0998 1.0993 1.0986 1.0986 1.0978 1.0981 1.1012 1.1017 1.0992 1.0987 1.0567 1.0853 1.0914 1.1170
irintensity: 3.7996 2.2627 1.1329 2.9840 2.8219 1.3874 3.5651 0.9278 0.9919 1.3447 2.2301 0.0354 0.5426 0.5933 0.7360 0.2361 0.1355 2.8502 0.4909 1.4691 6.6147 1.3555 2.7412 0.3846 2.1419 4.2410 2.8022 5.9453 2.3865 0.2256 0.9395 2.4798 5.8081 4.3382 2.3770 4.8847 4.8967 3.6986 1.4509 7.7238 1.4611 8.0906 3.4025 10.2878 2.0199 7.1017 5.9220 6.0447 0.3367 3.9867 19.8391 6.2752 4.4320 12.3949 8.0750 1.8434 17.7223 25.7982 14.1529 3.7006 5.6360 14.0465 8.8690 14.4598 3.9937 37.0159 5.7390 15.1955 0.4556 2.2340 3.7884 1.4581 1.1529 6.8877 1.6392 4.4464 0.8848 12.5359 10.0281 12.6805 13.5633 30.0866 6.0693 2.4793 1.2685 39.2775 2.3497 6.6071 1.0486 0.4997 5.2600 2.7177 2.8405 6.8798 3.6837 1.3180 8.4800 5.1214 9.5352 2.1057 22.4511 18.5223 16.3264 11.3906 4.8167 9.4349 4.4546 5.7402 8.4875 14.0752 11.8053 6.8905 179.2665 160.1120 189.3538 14.2291 0.4976 23.1437 28.5179 28.2448 23.1563 26.0857 28.5761 16.3797 27.3774 23.8969 18.4961 17.5682 35.8783 10.8393 58.3139 9.2895 9.0084 28.0796 40.2178 18.7430 29.5601 7.1797 8.0622 7.2466 1.7867
temp: 298.150 k
press: 1.00000 atm
elementType: 16 8 8 6 6 6 6 6 6 6 6 6 6 6 6 6 6 6 6 6 6 6 6 1 1 1 1 1 1 1 1 1 1 1 1 1 1 1 1 1 1 1 1 1 1 1 1 1 1
symmnumber: 1
zpe: 1087915.4 jmol-1
zpe.correction: 0.414365 hartree
zpe.thermalcorrener: 0.435526 hartree
zpe.thermalcorrenthalpy: 0.436470 hartree
zpe.thermalcorrgfe: 0.365117 hartree
zpe.sumelectzpe: -1324.470269 hartree
zpe.sumelectthermal: -1324.449108 hartree
zpe.sumelectthermalent: -1324.448164 hartree
zpe.sumelectthermalfe: -1324.519517 hartree
dipole: -1.1486 -0.2477 0.4272
dipole: 1.2503
quadrupole: -183.9515 -159.6144 -137.9774
quadrupole: 23.6377 -10.7387 -3.9479
quadrupole: -23.4371 0.9000 22.5371 23.6377 -10.7387 -3.9479
hfenergy: -1324.8846337 hartree
pointgroup: C01 [X(C20H26O2S1)]
dipole: -0.4471344 0.1963672 -0.05893 debye
polarizability: 268.430927|7.4942081|197.4030517|16.8150099|1.9745375|203.1571047 unknown
InChI: InChI=1S/C20H26O2S/c1-19-8-7-16-14(15(19)4-5-17(19)22)3-2-12-10-13(21)6-9-20(12,16)18-11-23-18/h10,14-16,18H,2-9,11H2,1H3
charge 0 multiplicity 1
49 atoms
S  2.282362 -1.936158 -2.621595
O  -5.324035 -1.06566 0.245213
O  4.820536 1.52669 1.709842
C  -0.063779 -0.604811 -0.371686
C  -0.743355 0.800766 -0.241411
C  1.48906 -0.521365 -0.050099
C  -2.261791 0.645329 -0.456953
C  -2.930228 -0.395862 0.48615
C  -0.785309 -1.727475 0.434584
C  2.189292 -1.744058 -0.69405
C  -2.319582 -1.782411 0.203945
C  -0.149441 1.800152 -1.28369
C  2.045353 0.816662 -0.567678
C  -3.195742 1.883992 -0.381387
C  1.777098 -0.607014 1.489457
C  1.303125 1.434982 -1.724935
C  -4.418479 -0.205962 0.13166
C  -4.613127 1.239424 -0.384616
C  3.588799 -1.74474 -1.226716
C  -2.833085 -0.029422 2.002521
C  3.257103 -0.34911 1.843727
C  3.110497 1.446638 0.026425
C  3.809315 0.934515 1.2208
H  -0.141932 -0.88426 -1.445497
H  -0.554143 1.197536 0.778553
H  -2.379084 0.233267 -1.488063
H  -0.606736 -1.594034 1.516663
H  -0.350462 -2.709495 0.164895
H  1.859933 -2.692114 -0.248627
H  -2.537862 -2.072687 -0.843192
H  -2.77303 -2.555482 0.851929
H  -0.160218 2.821557 -0.860441
H  -0.792675 1.818729 -2.185499
H  -3.051367 2.578819 -1.226378
H  -3.0197 2.456469 0.54854
H  1.485509 -1.599115 1.879073
H  1.143276 0.143641 2.001992
H  1.828905 2.330915 -2.099491
H  1.262649 0.701089 -2.552835
H  -5.030921 1.178974 -1.4085
H  -5.363341 1.771211 0.227716
H  4.131688 -0.796346 -1.269681
H  4.204241 -2.637286 -1.075901
H  -1.785679 0.022804 2.345362
H  -3.30391 0.943924 2.229347
H  -3.353395 -0.800888 2.597999
H  3.890659 -1.188876 1.493207
H  3.403081 -0.290071 2.937353
H  3.478228 2.402818 -0.367534
