program: Gaussian 09
title: 000175510
version: EM64L-G09RevD.01
frameworkgroup: C1[X(C9H15NO5S)]
method: RPBEPBE
basis: SDD
operation: Freq
keyword: #p
keyword: freq=noraman
keyword: PBEPBE/SDD
title: #p freq=noraman PBEPBE/SDD
converged: YES YES NO NO
title: Mulliken charges:
elementType: S O O O O O N C C C C C C C C C H H H H H H H H H H H H H H H
charge: 0.139502 -0.412104 -0.419543 -0.232856 -0.236366 -0.277450 -0.375857 -0.136719 -0.109986 -0.684304 -0.659801 -0.695209 0.196366 0.172932 0.264292 -0.771266 0.256924 0.298820 0.292061 0.279258 0.304394 0.281341 0.233297 0.227750 0.234644 0.336866 0.255547 0.254734 0.215828 0.377018 0.389886
chargesum: 0.00000
title: Mulliken charges with hydrogens summed into heavy atoms:
elementType: S O O O O O N C C C C C C C C C
charge: 0.139502 -0.035086 -0.029657 -0.232856 -0.236366 -0.277450 -0.038990 0.120205 0.188834 -0.112985 -0.074067 0.000482 0.196366 0.172932 0.264292 -0.045157
polarizability: 1.65659142e+02 -1.53664665e+01 1.29147777e+02 -1.65183869e+00 -5.58085166e-01 1.21511786e+02
1716.lowfreq: -10.7935 -7.9752 0.0011 0.0012 0.0013 2.1519 11.1613 17.3872 26.3796
frequency: 4.9569 17.3750 26.3277 33.2923 39.1351 59.1220 70.2190 81.4791 92.9392 116.0907 140.1948 170.3853 196.5712 217.7868 234.3664 265.0639 271.3429 317.1267 345.6047 353.3246 458.9921 465.6145 498.5447 514.2994 530.4377 583.9153 595.8781 610.1275 615.1098 624.9002 652.1655 695.1650 714.3788 724.4827 757.9040 814.7997 893.9926 900.5310 935.8856 946.8644 978.5656 995.2177 1034.7003 1043.5587 1043.9383 1066.5418 1078.0715 1121.4107 1133.2091 1178.2068 1186.2240 1224.0414 1243.1349 1247.6575 1263.9949 1282.6751 1308.1222 1321.0950 1324.3852 1370.3071 1388.9006 1389.4388 1426.6830 1449.0521 1450.1995 1463.0459 1473.5997 1481.0680 1481.3614 1609.2706 1660.4156 1667.0745 2963.0221 2990.2801 2999.0162 3026.8966 3043.5555 3050.7321 3093.2018 3096.9610 3099.2130 3103.8294 3109.7339 3129.9555 3504.8490 3520.9540 3574.6731
redmass: 6.2557 5.2757 6.1788 4.9453 5.2602 7.6854 1.2514 8.0542 3.3036 7.0002 4.2905 3.9933 4.2321 1.1634 3.3019 3.4590 2.8670 4.0235 3.5898 4.0402 2.7601 3.7261 4.2016 3.7456 1.4300 3.5491 3.0721 3.3452 1.3191 3.3404 1.6584 4.4131 4.5418 4.1557 2.8461 3.3229 2.0093 1.7241 1.8318 4.5583 2.5346 1.6320 2.2422 1.9438 1.6728 2.2578 1.8722 1.5745 1.8573 1.4696 1.6178 1.3472 1.4860 1.5536 1.2120 1.7162 1.3393 1.5359 1.8723 1.6385 1.2707 1.2283 1.0842 1.0894 1.0457 1.2094 1.0485 1.5526 1.1614 6.2978 9.1618 8.0821 1.0799 1.0343 1.0359 1.0581 1.0837 1.0582 1.1009 1.1013 1.0981 1.1008 1.1083 1.1075 1.0638 1.0642 1.0785
irintensity: 4.4959 0.9766 0.6235 1.5390 3.9923 6.2652 4.6000 0.1896 3.6799 1.6606 6.5591 2.3103 1.3511 0.8727 1.8947 3.5404 2.8590 2.0406 3.4506 0.6010 9.0509 39.0787 21.4103 32.1778 98.8587 10.8572 19.0549 7.5478 121.7550 56.4552 126.9914 0.8739 24.9974 41.1728 6.4278 9.5227 7.6859 5.7923 6.8131 24.7098 62.2415 11.5738 82.1874 198.2204 8.1795 45.5205 172.1202 1.3801 12.0982 4.7561 19.0843 10.1632 8.5725 3.9943 7.3830 79.9859 9.1799 23.3432 24.4116 21.5595 26.6691 65.5985 24.2355 10.1115 15.8122 132.3035 17.7250 171.5783 47.7688 158.9939 224.1914 169.9439 20.7009 23.4286 8.8670 7.9513 5.3446 7.2252 25.6616 17.8961 8.4506 17.9504 8.9558 2.3288 22.5339 33.9356 37.9879
temp: 298.150 k
press: 1.00000 atm
elementType: 16 8 8 8 8 8 7 6 6 6 6 6 6 6 6 6 1 1 1 1 1 1 1 1 1 1 1 1 1 1 1
symmnumber: 1
zpe: 629706.7 jmol-1
zpe.correction: 0.239843 hartree
zpe.thermalcorrener: 0.259121 hartree
zpe.thermalcorrenthalpy: 0.260065 hartree
zpe.thermalcorrgfe: 0.186067 hartree
zpe.sumelectzpe: -1179.660886 hartree
zpe.sumelectthermal: -1179.641607 hartree
zpe.sumelectthermalent: -1179.640663 hartree
zpe.sumelectthermalfe: -1179.714661 hartree
dipole: -0.5824 2.0385 4.3965
dipole: 4.8810
quadrupole: -102.6186 -97.5173 -104.6332
quadrupole: 1.5395 7.2929 -1.8204
quadrupole: -1.0289 4.0724 -3.0435 1.5395 7.2929 -1.8204
hfenergy: -1179.9007283 hartree
pointgroup: C01 [X(C9H15N1O5S1)]
dipole: -0.3097647 -0.9612417 -1.6333093 debye
polarizability: 162.59897|18.0346024|131.7611244|-3.5192838|-2.9124117|121.9586104 unknown
InChI: InChI=1S/C9H15NO5S/c1-5(8(12)13)3-16-4-7(9(14)15)10-6(2)11/h5,7,10,12,14H,3-4H2,1-2H3
charge 0 multiplicity 1
31 atoms
S  -0.772224 0.73087 0.084845
O  -4.614737 1.379459 -0.781104
O  1.907489 -1.91259 -1.152722
O  -4.240584 1.386785 1.510493
O  0.799522 -2.394638 0.828009
O  3.799654 1.796858 0.95315
N  2.470669 0.58687 -0.507903
C  -3.331076 -0.46089 0.131407
C  1.886675 -0.196704 0.582574
C  -1.992823 -0.487878 0.892979
C  0.696202 0.520673 1.265857
C  -4.237514 -1.639454 0.592591
C  -4.070114 0.847454 0.395911
C  1.463366 -1.594075 0.135129
C  3.423602 1.556558 -0.236817
C  3.975986 2.303423 -1.443561
H  -3.156551 -0.545696 -0.955736
H  2.677188 -0.309375 1.35672
H  -1.54114 -1.492366 0.863317
H  -2.146335 -0.170703 1.938429
H  1.019792 1.520676 1.591343
H  0.349442 -0.057096 2.137425
H  -5.209522 -1.616931 0.0693
H  -3.745947 -2.602225 0.368336
H  -4.424379 -1.583691 1.679528
H  2.195665 0.366491 -1.465468
H  3.749849 3.37854 -1.337893
H  5.074603 2.201314 -1.457084
H  3.569551 1.94632 -2.405116
H  -5.112555 2.21455 -0.562907
H  1.610045 -2.833527 -1.385833
