program: Gaussian 09
title: 000175498
version: EM64L-G09RevD.01
frameworkgroup: C1[X(C14H28O2)]
method: RPBEPBE
basis: SDD
operation: Freq
keyword: #pfreq=noraman
keyword: PBEPBE/SDD
title: #p freq=noraman PBEPBE/SDD
converged: YES YES NO NO
title: Mulliken charges:
elementType: O O C C C C C C C C C C C C C C H H H H H H H H H H H H H H H H H H H H H H H H H H H H
charge: -0.275650 -0.268163 -0.366500 -0.430012 -0.343104 -0.460304 -0.462140 0.070909 -0.355429 -0.183465 -0.216249 -0.693777 -0.232146 -0.202485 -0.674011 -0.684714 0.198946 0.193189 0.237342 0.194982 0.186138 0.188988 0.195846 0.203595 0.234135 0.202720 0.175961 0.194478 0.194509 0.229417 0.224035 0.209699 0.215537 0.210181 0.189280 0.185046 0.221191 0.178254 0.201385 0.231286 0.225139 0.201673 0.232458 0.221828
chargesum: 0.00000
title: Mulliken charges with hydrogens summed into heavy atoms:
elementType: O O C C C C C C C C C C C C C C
charge: -0.275650 -0.268163 0.025634 0.002312 0.032022 -0.060862 -0.025285 0.246870 0.033557 0.045952 0.007786 -0.058360 0.142181 0.196961 -0.016201 -0.028755
polarizability: 1.83023039e+02 -4.34180934e+00 1.52514092e+02 -9.77687991e+00 -6.32088002e-01 1.54333952e+02
1716.lowfreq: -12.3372 -7.4104 -0.0006 -0.0006 0.0005 5.8772 9.7822 14.5838 27.5519
frequency: 6.0219 14.2668 27.1155 39.7525 47.6501 51.4554 56.7604 59.9789 88.8112 102.3654 122.8480 133.4448 154.8345 182.4576 208.9455 219.4506 231.7870 238.4368 246.6277 261.0048 274.7338 320.2785 329.8225 346.2297 422.3299 450.7441 471.4184 510.9703 531.0001 542.7438 723.2721 747.8716 764.9520 810.6383 813.8890 814.9250 824.8097 843.5288 880.0152 888.9966 894.9072 940.6157 953.3540 974.4092 984.2386 1001.9440 1007.8920 1037.0746 1043.6236 1049.8223 1062.5131 1074.9882 1087.9561 1104.5858 1109.4975 1115.8429 1121.2180 1135.6042 1136.8458 1145.2204 1187.3991 1205.7033 1223.4617 1232.1742 1245.8487 1251.3244 1252.7534 1277.6794 1279.3471 1286.6522 1294.7980 1300.8862 1305.1469 1322.1342 1331.3519 1343.8479 1347.7543 1350.6521 1375.5922 1383.1114 1390.2033 1393.9934 1398.3752 1448.0448 1457.2169 1458.8256 1459.5742 1460.5361 1462.6289 1469.0991 1477.0958 1478.1616 1479.2312 1480.5373 1487.5805 1491.4730 1493.9474 1683.4005 2879.6850 2919.2147 2931.5142 2950.6982 2952.3572 2960.7463 2966.2589 2968.5792 2971.8532 2972.6862 2989.7117 2991.5952 2992.8371 2994.7997 3003.7678 3020.1358 3022.0995 3039.1149 3045.8268 3058.7802 3066.3488 3068.2868 3070.9554 3072.0318 3088.9319 3090.0149 3099.2916 3100.5807
redmass: 3.5840 3.8355 2.4182 2.4653 1.9792 2.4801 2.3310 2.3936 2.2840 2.9618 1.9632 2.4821 2.6229 2.7300 2.5679 2.5408 1.1170 1.2973 1.3041 2.3776 4.0567 3.0503 3.2821 2.6244 2.7260 2.9326 2.8093 2.6279 3.2217 3.5682 1.0692 1.1678 1.6161 1.3374 1.1147 1.5414 1.4286 2.1085 2.0969 1.9352 2.1067 2.2454 1.8476 1.5893 1.5360 3.6634 2.1236 2.4361 3.0669 2.1422 2.5777 2.3165 2.5438 2.5266 2.0664 2.1518 2.2521 1.4864 1.4431 2.1053 1.5719 1.4159 1.3624 1.3007 1.1581 1.2459 1.1544 1.1429 1.2238 1.1136 1.2177 1.3137 1.1863 1.1938 1.3513 1.4391 1.3964 1.6317 1.3916 1.2470 1.2161 1.2968 1.3356 1.0891 1.0840 1.0410 1.0646 1.0742 1.0725 1.0758 1.0427 1.0508 1.0750 1.0476 1.0841 1.0803 1.0804 6.5541 1.0825 1.0558 1.0645 1.0608 1.0590 1.0599 1.1052 1.0597 1.0366 1.0641 1.0971 1.0359 1.0359 1.0624 1.0984 1.1022 1.0968 1.1036 1.0917 1.0963 1.0966 1.1007 1.0993 1.0918 1.0989 1.0991 1.1010 1.1008
irintensity: 0.2957 0.0557 0.4794 0.3954 0.4110 1.2199 0.2442 0.8778 2.1626 3.0452 0.3415 0.5038 0.5615 2.8730 0.9948 1.8191 0.0335 0.1814 1.6992 1.7464 1.4271 1.4449 6.8769 0.5325 2.8552 0.4451 5.6659 0.4835 5.5669 2.0379 10.1327 0.5263 3.5663 4.0061 4.5008 9.6570 0.5086 17.6924 3.7095 5.4640 13.0152 137.4014 76.1081 41.1790 15.8648 2.8043 24.5853 54.8875 81.5401 16.7535 51.3689 0.0618 9.2653 20.1723 1.3160 9.5758 39.9721 7.0145 5.2033 20.9533 1.6231 0.8484 0.8086 3.4605 2.9699 0.2434 0.4921 0.7555 0.7073 0.9576 2.2833 0.4558 5.7000 30.8018 6.5802 4.4720 19.5211 0.4315 6.8547 15.9247 11.2437 14.7209 15.7447 10.4121 2.7199 10.5153 7.6692 18.4608 0.4044 1.6645 12.2719 6.7017 3.3269 5.3212 20.0058 5.9088 5.1771 0.3451 49.1126 62.4572 76.0434 10.1194 11.3974 8.1133 48.9132 138.4663 42.0854 38.5661 1.6560 30.4321 24.9769 31.2985 2.8008 0.7617 29.3710 83.8417 6.7207 9.3593 1.6767 78.1233 50.0163 114.0557 35.8745 36.9883 39.9712 36.2782
temp: 298.150 k
press: 1.00000 atm
elementType: 8 8 6 6 6 6 6 6 6 6 6 6 6 6 6 6 1 1 1 1 1 1 1 1 1 1 1 1 1 1 1 1 1 1 1 1 1 1 1 1 1 1 1 1
symmnumber: 1
zpe: 1030855.5 jmol-1
zpe.correction: 0.392632 hartree
zpe.thermalcorrener: 0.414231 hartree
zpe.thermalcorrenthalpy: 0.415175 hartree
zpe.thermalcorrgfe: 0.336403 hartree
zpe.sumelectzpe: -699.358285 hartree
zpe.sumelectthermal: -699.336686 hartree
zpe.sumelectthermalent: -699.335742 hartree
zpe.sumelectthermalfe: -699.414514 hartree
dipole: -1.9184 1.5182 -0.6078
dipole: 2.5208
quadrupole: -110.6626 -100.9977 -95.6384
quadrupole: 2.2949 -3.0773 -0.4111
quadrupole: -8.2297 1.4352 6.7945 2.2949 -3.0773 -0.4111
hfenergy: -699.7509171 hartree
pointgroup: C01 [X(C14H28O2)]
dipole: -0.7083484 -0.4911943 0.4904661 debye
polarizability: 183.981889|7.7306626|152.5020182|5.1364438|-0.5035421|153.3871749 unknown
InChI: InChI=1S/C14H28O2/c1-4-7-8-9-10-11-12-13-14(15-5-2)16-6-3/h10-11,14H,4-9,12-13H2,1-3H3
charge 0 multiplicity 1
44 atoms
O  3.208981 -0.721598 0.477728
O  2.287752 0.137736 -1.523748
C  -2.961195 0.196475 0.122678
C  2.424863 1.62785 0.348238
C  -4.3838 -0.103995 0.64573
C  -2.507773 1.657424 0.391653
C  1.317088 2.603415 -0.136073
C  2.182055 0.179909 -0.089342
C  -4.824762 -1.565724 0.404946
C  -1.155839 1.969912 -0.215019
C  -0.039726 2.318763 0.478273
C  -6.254209 -1.856399 0.911762
C  2.799172 -1.371031 1.732964
C  1.933436 -1.173393 -2.1065
C  3.923226 -2.323295 2.142259
C  2.06322 -1.046515 -3.62333
H  -2.235404 -0.498503 0.592155
H  -2.922182 -0.00226 -0.968742
H  3.407691 1.936175 -0.052673
H  2.495191 1.649294 1.453707
H  -5.106983 0.582026 0.156447
H  -4.432402 0.118599 1.732429
H  -3.275455 2.341565 -0.029089
H  -2.482972 1.841592 1.484113
H  1.253495 2.549968 -1.237847
H  1.631924 3.634467 0.126122
H  1.175643 -0.18497 0.235865
H  -4.763155 -1.79011 -0.67975
H  -4.107336 -2.248897 0.904016
H  -1.08596 1.883899 -1.312196
H  -0.102406 2.400173 1.576886
H  -6.335747 -1.667334 1.998978
H  -6.544042 -2.907654 0.729195
H  -6.993618 -1.208772 0.403586
H  2.627243 -0.608944 2.52488
H  1.844354 -1.923075 1.579696
H  2.617244 -1.944149 -1.701752
H  0.891863 -1.432918 -1.810924
H  3.667801 -2.842931 3.084065
H  4.863779 -1.765757 2.291527
H  4.093761 -3.080184 1.357063
H  1.808373 -2.004381 -4.112987
H  3.097594 -0.77693 -3.897702
H  1.387918 -0.263421 -4.009989
