program: Gaussian 09
title: 000175494
version: EM64L-G09RevD.01
frameworkgroup: C1[X(C20H26N2O4)]
method: RPBEPBE
basis: SDD
operation: Freq
keyword: #p
keyword: freq=noraman
keyword: PBEPBE/SDD
title: #p freq=noraman PBEPBE/SDD
converged: NO YES NO NO
title: Mulliken charges:
elementType: O O O O N N C C C C C C C C C C C C C C C C C C C C H H H H H H H H H H H H H H H H H H H H H H H H H H
charge: -0.465474 -0.464054 -0.480020 -0.270428 -0.125803 -0.018159 -0.149241 -0.045461 -0.133107 -0.545110 -0.533396 -0.486137 -0.447754 -0.132681 -0.289678 -0.381988 0.452945 0.247110 -0.329297 -0.072231 -0.543151 -0.389021 -0.314855 0.295024 -0.361619 -0.537156 0.222327 0.228655 0.286810 0.229262 0.232817 0.274904 0.243625 0.219251 0.220781 0.228106 0.249761 0.223666 0.220719 0.208794 0.210786 0.365039 0.364466 0.266264 0.359068 0.237352 0.234257 0.258943 0.245354 0.220380 0.245093 0.224258
chargesum: 0.00000
title: Mulliken charges with hydrogens summed into heavy atoms:
elementType: O O O O N N C C C C C C C C C C C C C C C C C C C C
charge: -0.100435 -0.099588 -0.120953 -0.270428 -0.125803 -0.018159 0.073086 0.183193 0.153703 -0.083030 -0.014866 -0.046104 0.030113 0.090985 -0.068959 0.037592 0.452945 0.247110 -0.063033 -0.072231 -0.305799 -0.154764 -0.055912 0.295024 -0.116265 0.152576
polarizability: 2.66442203e+02 3.38198049e+01 2.64732512e+02 -2.92382099e+01 1.35261669e+01 2.03288738e+02
1716.lowfreq: -5.9922 -4.1692 -0.0006 0.0006 0.0007 4.2851 22.4603 25.3890 34.9523
frequency: 21.4717 25.2598 34.7502 55.4120 63.1027 74.2549 105.6078 106.9384 133.9884 139.8082 150.1043 177.0037 189.3851 211.4109 220.3740 236.1895 238.3745 243.9625 257.4186 291.5730 295.2178 323.4629 333.9565 354.5751 377.4252 391.3535 422.6833 427.9455 451.3058 453.9595 494.7919 507.4260 520.4589 537.9289 547.8168 552.0112 561.8473 586.5410 599.1132 623.4391 631.7732 675.9144 692.3894 736.3857 744.6938 776.9387 788.7298 793.1190 813.1801 827.6709 834.8878 845.7221 857.5956 872.1408 873.9837 881.4925 884.5519 915.6156 927.3726 953.5434 964.9161 965.7841 970.9553 978.0498 992.0985 1004.9033 1022.9196 1028.0218 1033.6957 1038.8661 1054.7170 1058.2609 1062.6519 1076.6678 1087.4621 1111.1959 1121.2958 1123.0064 1134.9583 1159.0975 1160.2786 1176.1637 1186.5854 1191.1150 1205.2895 1218.5420 1221.6226 1228.7511 1242.7634 1250.1192 1255.2870 1258.6196 1272.3647 1294.9919 1299.4385 1304.1625 1306.9827 1311.5547 1317.5762 1326.6997 1334.5780 1340.5434 1344.9659 1349.0312 1356.9209 1360.7274 1378.7116 1382.6107 1402.0682 1405.0360 1426.4886 1436.5581 1458.7454 1460.1539 1467.5118 1467.9429 1469.0126 1474.4106 1477.4088 1487.6511 1508.2589 1548.7135 1582.8658 1630.3423 2937.9678 2942.9785 2957.0108 2960.8270 2985.4733 2989.8086 2995.1909 2998.3888 3013.9553 3019.1176 3025.2997 3027.5760 3041.5614 3050.0413 3052.5259 3075.2575 3086.1502 3123.9696 3124.1960 3150.6233 3157.4042 3168.2510 3172.5642 3181.3750 3510.8685 3598.0470
redmass: 5.1433 5.9417 4.3793 5.0798 4.7463 3.4938 4.3702 2.9750 4.2625 4.7337 4.1332 4.2732 3.9166 2.5688 2.4289 1.6291 1.4037 1.8666 4.1040 5.3236 3.8101 3.2447 3.1110 4.7058 3.3766 3.1208 4.5401 2.8464 2.7616 2.9096 3.3985 1.4089 3.2468 3.7952 3.8168 4.6545 3.8863 3.8852 3.2187 6.2763 6.2266 3.7649 5.9714 3.0260 1.2879 2.7468 2.1978 2.7029 1.6466 1.8314 2.4212 2.5376 4.2885 2.0075 1.6478 5.0121 1.9545 2.7986 2.0865 3.0888 2.7937 1.5903 1.4891 4.5033 2.7595 3.7709 2.9633 3.1505 2.2810 2.9874 2.7795 2.0008 2.5996 2.2705 3.0757 1.2565 1.7894 1.7749 1.3917 1.2664 1.2386 1.1435 2.0611 1.2259 1.2849 1.5131 1.2843 2.1416 1.4821 1.7463 1.3577 1.9979 1.3885 1.2702 1.3036 1.6299 1.3763 1.3407 1.3886 1.2783 1.2602 1.4645 1.5162 1.4364 1.2967 2.0516 1.4233 3.4157 1.6098 1.6566 2.3199 1.4432 1.0835 2.5952 1.0815 1.0503 1.0809 1.0956 1.0890 1.0882 3.8782 6.7135 6.8577 6.9844 1.0821 1.0822 1.0557 1.0329 1.0604 1.0841 1.0644 1.0821 1.0630 1.0657 1.0943 1.0912 1.1038 1.1042 1.1021 1.1057 1.1060 1.0909 1.0983 1.0872 1.0907 1.0940 1.0972 1.0638 1.0648 1.0670
irintensity: 0.2788 0.1761 1.3304 0.1408 6.3348 3.9098 3.4700 5.0368 0.8714 1.5332 4.0332 1.4784 0.5326 2.0228 5.5843 75.3110 42.2736 29.2939 2.3009 15.1753 7.5823 1.7116 0.2232 0.5943 0.7145 4.2687 1.6003 9.3499 0.1031 4.9205 9.2749 117.6059 41.6533 1.2306 16.5973 10.3324 7.0426 1.3079 5.7338 4.1951 19.0141 2.0204 12.9271 38.0460 40.2401 8.0022 3.6843 7.8712 8.8951 18.1355 34.9680 21.3014 5.1431 12.1341 53.2646 2.3973 18.4708 1.4895 5.6576 36.4841 25.5293 13.0669 0.8325 41.0698 10.8484 56.8402 76.9840 37.2164 25.4780 12.1086 17.6994 9.5742 18.7178 13.5054 6.6389 0.1409 23.1697 11.6524 4.7207 12.4386 4.9993 18.8335 160.8364 17.8389 15.2007 9.8473 3.3179 12.7886 15.1373 76.7971 36.0158 9.4557 10.3364 17.9447 7.3992 21.8838 0.9311 8.1101 1.7543 18.0441 7.2024 12.0295 27.6926 4.2835 14.7631 23.8144 5.9409 20.4486 91.9002 12.8600 5.2260 10.4255 5.3560 50.5232 5.9723 13.6654 18.8577 30.2086 14.9146 13.4898 88.0500 28.5775 16.0901 92.2615 33.0702 25.8159 42.6868 86.8381 28.4545 13.5451 21.6486 22.1621 68.6263 37.1193 103.7192 22.4844 11.5698 46.5358 27.3934 44.2158 33.4074 44.6177 8.1096 3.8046 9.5677 6.4708 15.8411 261.4479 26.2287 8.1810
temp: 298.150 k
press: 1.00000 atm
elementType: 8 8 8 8 7 7 6 6 6 6 6 6 6 6 6 6 6 6 6 6 6 6 6 6 6 6 1 1 1 1 1 1 1 1 1 1 1 1 1 1 1 1 1 1 1 1 1 1 1 1 1 1
symmnumber: 1
zpe: 1133961.0 jmol-1
zpe.correction: 0.431903 hartree
zpe.thermalcorrener: 0.455678 hartree
zpe.thermalcorrenthalpy: 0.456622 hartree
zpe.thermalcorrgfe: 0.378039 hartree
zpe.sumelectzpe: -1186.122856 hartree
zpe.sumelectthermal: -1186.099082 hartree
zpe.sumelectthermalent: -1186.098138 hartree
zpe.sumelectthermalfe: -1186.176720 hartree
dipole: 1.4172 -7.3243 2.1631
dipole: 7.7674
quadrupole: -145.2221 -149.9235 -152.1344
quadrupole: 8.0788 2.2916 -3.8050
quadrupole: 3.8712 -0.8302 -3.0411 8.0788 2.2916 -3.8050
hfenergy: -1186.5547593 hartree
pointgroup: C01 [X(C20H26N2O4)]
dipole: -0.5206684 -1.852576 -2.373922 debye
polarizability: 265.8325994|-9.3793863|255.5754391|-45.3573076|23.4027555|213.0554137 unknown
InChI: InChI=1S/C20H26N2O4/c1-26-13-2-3-17-15(9-13)14(4-6-21-17)20(25)18-8-12-5-7-22(18)10-16(12)19(24)11-23/h2-4,6,9,12,16,18-20,23-25H,5,7-8,10-11H2,1H3
charge 0 multiplicity 1
52 atoms
O  -5.213519 0.921593 -0.571094
O  -0.156345 0.281977 3.208009
O  -4.516561 1.385853 -3.137767
O  3.828991 -2.239508 -1.311086
N  -2.16064 -0.806302 1.861644
N  2.865178 3.085091 0.260051
C  -2.326781 -1.612395 -0.594445
C  -3.633023 -0.855527 -0.199547
C  -1.131569 -0.092845 1.018396
C  -1.069998 -0.711166 -0.410551
C  -3.520057 -0.477237 1.327839
C  -2.177072 -2.835124 0.353617
C  -1.962246 -2.292819 1.810643
C  -3.927524 0.390849 -1.052314
C  0.205234 -0.059058 1.832116
C  -4.037044 0.112729 -2.558856
C  1.173186 0.981559 1.285781
C  2.24437 0.659784 0.368032
C  1.016825 2.317095 1.671119
C  3.060349 1.762353 -0.11911
C  2.55775 -0.662792 -0.071846
C  1.873055 3.328787 1.138246
C  4.128782 1.48938 -1.028266
C  3.617407 -0.895349 -0.958429
C  4.413016 0.190188 -1.450336
C  4.949158 -2.546084 -2.2044
H  -2.385473 -1.965785 -1.640366
H  -4.490715 -1.543909 -0.338292
H  -1.482572 0.956234 0.963577
H  -0.164167 -1.331453 -0.546372
H  -1.020618 0.086329 -1.173908
H  -3.712921 0.599071 1.471544
H  -4.264647 -1.028022 1.927507
H  -1.318301 -3.455117 0.034757
H  -3.08144 -3.47018 0.296691
H  -2.676856 -2.746085 2.519774
H  -0.948757 -2.52138 2.18308
H  -3.136821 1.160486 -0.904021
H  0.673919 -1.066015 1.810654
H  -3.051977 -0.162406 -2.98543
H  -4.769392 -0.70164 -2.741376
H  -5.493425 1.611522 -1.230795
H  -1.10701 -0.061185 3.283362
H  0.249858 2.57158 2.408088
H  -4.699124 1.279841 -4.103058
H  1.999855 -1.531343 0.288968
H  1.740973 4.374642 1.440318
H  4.718894 2.34354 -1.374184
H  5.241088 0.011554 -2.142446
H  4.824565 -2.062096 -3.192592
H  4.92674 -3.639279 -2.323915
H  5.916102 -2.240833 -1.759813
