program: Gaussian 09
title: 000175408
version: EM64L-G09RevD.01
frameworkgroup: C1[X(C16H34N2)]
method: RPBEPBE
basis: SDD
operation: Freq
keyword: #pfreq=noraman
keyword: PBEPBE/SDD
title: #p freq=noraman PBEPBE/SDD
converged: YES YES NO NO
title: Mulliken charges:
elementType: N N C C C C C C C C C C C C C C C C H H H H H H H H H H H H H H H H H H H H H H H H H H H H H H H H H H
charge: -0.069601 -0.069614 -0.373471 -0.368996 -0.373469 -0.369004 -0.345110 -0.345108 -0.401251 -0.401232 -0.361399 -0.361401 -0.352402 -0.352393 -0.355404 -0.355412 -0.696268 -0.696265 0.182457 0.202089 0.202857 0.180803 0.202088 0.182456 0.180805 0.202849 0.171807 0.202862 0.171812 0.202852 0.209311 0.199483 0.209309 0.199479 0.186631 0.185839 0.185840 0.186633 0.186386 0.189405 0.186385 0.189406 0.194279 0.194900 0.194902 0.194280 0.210145 0.215075 0.209578 0.210145 0.215075 0.209578
chargesum: 0.00000
title: Mulliken charges with hydrogens summed into heavy atoms:
elementType: N N C C C C C C C C C C C C C C C C
charge: -0.069601 -0.069614 0.011074 0.014663 0.011075 0.014650 0.029560 0.029556 0.007543 0.007556 0.011071 0.011072 0.023389 0.023398 0.033775 0.033770 -0.061469 -0.061467
polarizability: 2.49416015e+02 1.99604297e-04 1.71640692e+02 -1.64410876e+00 -3.45062260e-04 1.51678486e+02
1716.lowfreq: -6.9889 -0.0012 0.0009 0.0021 4.8993 12.6679 22.3122 32.0511 44.1474
frequency: 22.3120 30.9874 44.1473 46.3685 55.4280 55.7937 76.4619 84.4236 111.7304 116.3844 124.4003 131.6509 138.3148 153.5009 167.2212 200.9464 231.8906 232.3788 237.4629 248.7545 249.1489 286.2519 328.9775 336.9863 388.7805 403.4368 433.5478 448.8084 467.2913 499.1226 526.2822 623.9866 726.5672 726.5762 744.9221 745.5730 761.3568 787.0880 795.9279 798.2140 848.2613 882.2657 885.5197 888.4899 890.2892 935.3323 987.4370 987.7691 996.5712 999.9135 1012.5047 1021.1196 1039.0280 1049.1735 1059.2769 1066.9001 1068.2401 1081.7000 1082.0832 1090.8974 1106.7494 1119.6962 1124.4341 1132.8226 1138.8998 1150.7251 1164.6648 1187.2361 1197.1752 1201.8796 1211.9433 1231.2747 1241.0004 1250.7656 1257.9589 1267.2927 1273.3578 1284.9936 1286.6347 1290.4098 1290.7489 1295.3363 1296.4238 1299.6002 1304.2899 1309.6341 1335.3342 1336.4336 1341.5778 1348.7172 1355.8792 1356.1015 1368.9379 1370.9009 1388.6838 1388.7359 1391.0779 1395.9763 1450.9167 1451.6928 1459.4879 1461.6781 1464.2306 1465.0887 1465.2739 1465.3805 1469.8797 1471.2246 1476.7480 1476.8513 1476.8548 1477.6725 1484.8533 1485.3671 1490.1816 1490.3810 2822.7589 2823.0081 2841.7731 2854.2630 2855.7140 2869.1789 2950.5457 2950.5719 2955.4476 2955.4510 2966.8505 2966.8582 2971.4975 2971.5270 2976.9581 2977.0189 2987.3399 2987.3428 2996.2680 2996.5065 3003.9020 3003.9190 3021.6353 3026.1353 3027.4499 3027.6454 3041.4466 3045.2961 3048.7198 3050.7762 3068.3258 3068.3261 3070.0161 3070.0306
redmass: 3.5667 3.0302 3.5209 2.8973 1.5743 1.7887 3.4380 2.6666 1.7176 1.7729 2.4611 3.3971 2.1991 2.1952 4.0176 2.9332 1.1330 1.1253 2.0637 2.0059 4.0585 2.8506 2.8909 2.2451 2.9334 2.2960 2.8552 2.8899 3.2397 2.9079 4.0785 1.9754 1.0665 1.0661 1.1012 1.1034 4.2866 2.8788 1.1745 1.1996 1.5304 1.2478 1.2494 1.9085 1.8053 2.0837 1.2062 1.2153 2.6744 3.9378 3.1977 2.6140 3.1710 2.4383 1.9215 2.7341 2.4713 2.2012 2.1507 1.9953 1.9782 2.5997 2.0987 2.9312 2.5058 2.9264 1.9714 1.9685 1.1389 1.4889 1.5310 1.2479 1.4096 1.2824 1.3537 1.2802 1.2575 1.0837 1.0647 1.1682 1.1643 1.2947 1.2090 1.1556 1.3401 1.3221 1.3048 1.3466 1.4343 1.4644 1.6413 1.6511 1.3852 1.4718 1.2231 1.2188 1.3926 1.5081 1.0805 1.0795 1.0882 1.0807 1.0777 1.0728 1.0685 1.0758 1.0792 1.0852 1.0752 1.0426 1.0426 1.0808 1.0829 1.0854 1.0948 1.0959 1.0704 1.0702 1.0708 1.0699 1.0703 1.0677 1.0589 1.0589 1.0590 1.0590 1.0590 1.0590 1.0366 1.0366 1.0610 1.0611 1.0972 1.0972 1.0853 1.0850 1.1012 1.1011 1.0909 1.0891 1.1037 1.1016 1.0917 1.0963 1.1018 1.0940 1.1006 1.1006 1.0993 1.0993
irintensity: 0.0026 0.0767 0.0070 0.0782 0.0054 0.0011 0.1462 0.0592 0.5151 0.0156 0.2797 0.0327 0.0408 1.0438 0.0097 1.7518 0.0013 0.0000 0.5962 0.5957 0.2532 0.6231 4.3216 8.3949 0.0657 0.0312 0.5730 0.0006 3.6190 2.4563 0.0427 1.3584 15.1384 7.6173 0.0744 0.1535 0.0058 28.3185 1.8657 0.3551 0.1067 0.0133 3.5119 0.1249 11.2832 1.5376 2.4039 0.4432 37.7996 0.0787 0.7258 0.0180 19.7921 0.0123 0.1830 0.4327 1.2844 0.0962 0.0460 1.4198 43.2780 7.8722 10.9837 18.9123 3.7033 84.2757 5.4641 0.1330 1.1263 0.0177 2.1086 6.3432 5.0703 3.1893 4.3131 9.1988 5.7061 4.0442 4.3100 0.0178 1.5699 2.2962 1.5539 6.5759 12.5669 4.3147 23.6863 6.7381 0.0893 2.0542 0.5010 1.2737 23.1373 0.1169 8.1737 12.4054 4.8849 0.1276 2.6522 0.2038 18.2260 1.3491 2.5587 0.0274 0.0838 0.5475 2.6339 0.1560 4.3930 11.0936 13.3234 0.2083 2.7731 0.0647 26.5472 21.5953 142.7175 0.9900 83.4598 10.2463 9.8962 320.1558 3.9358 1.4292 14.4476 12.1150 60.7258 85.5929 46.8901 23.8881 47.6127 46.3297 0.2928 2.9245 16.3388 47.8289 0.9855 0.1848 32.7356 82.6373 19.6847 0.0429 99.7187 6.0625 79.0825 110.3536 107.2014 88.5942 104.9877 8.0625
temp: 298.150 k
press: 1.00000 atm
elementType: 7 7 6 6 6 6 6 6 6 6 6 6 6 6 6 6 6 6 1 1 1 1 1 1 1 1 1 1 1 1 1 1 1 1 1 1 1 1 1 1 1 1 1 1 1 1 1 1 1 1 1 1
symmnumber: 1
zpe: 1253032.9 jmol-1
zpe.correction: 0.477255 hartree
zpe.thermalcorrener: 0.499816 hartree
zpe.thermalcorrenthalpy: 0.500760 hartree
zpe.thermalcorrgfe: 0.422994 hartree
zpe.sumelectzpe: -738.061617 hartree
zpe.sumelectthermal: -738.039056 hartree
zpe.sumelectthermalent: -738.038111 hartree
zpe.sumelectthermalfe: -738.115877 hartree
dipole: 0.0001 0.0207 0.0000
dipole: 0.0207
quadrupole: -114.2267 -113.7323 -118.5564
quadrupole: -0.0003 -2.7601 -0.0004
quadrupole: 1.2784 1.7729 -3.0513 -0.0003 -2.7601 -0.0004
hfenergy: -738.5388716 hartree
pointgroup: C01 [X(C16H34N2)]
dipole: 0.0000229 -0.0081289 0.0000123 debye
polarizability: 249.4147898|0.00026|171.6406767|1.6801313|-0.0176767|151.6797267 unknown
InChI: InChI=1S/C16H34N2/c1-3-5-7-9-11-17-13-15-18(16-14-17)12-10-8-6-4-2/h3-16H2,1-2H3
charge 0 multiplicity 1
52 atoms
N  1.457719 -0.929464 -0.056349
N  -1.457738 -0.929255 0.058245
C  0.693286 -2.141115 0.333187
C  0.696767 0.285755 0.325759
C  -0.693394 -2.141674 -0.329074
C  -0.696681 0.28521 -0.326074
C  2.837209 -0.9534 0.492055
C  -2.837235 -0.95412 -0.49013
C  3.767309 0.115531 -0.117147
C  -3.767397 0.115756 0.117316
C  5.234005 -0.059871 0.338478
C  -5.234059 -0.060325 -0.338146
C  6.181854 1.018892 -0.232077
C  -6.181892 1.019363 0.230694
C  7.651282 0.838532 0.2128
C  -7.651304 0.838417 -0.213992
C  8.592544 1.920319 -0.35974
C  -8.592506 1.921175 0.356814
H  0.55848 -2.202833 1.443809
H  1.257669 -3.034902 0.005904
H  1.247814 1.180905 -0.01269
H  0.574026 0.352974 1.438005
H  -1.257846 -3.034809 -0.000134
H  -0.558608 -2.205446 -1.439583
H  -0.573923 0.35039 -1.438439
H  -1.247641 1.181027 0.010742
H  2.836341 -0.847267 1.610303
H  3.26023 -1.953286 0.268491
H  -2.836402 -0.849873 -1.608559
H  -3.260194 -1.953647 -0.264871
H  3.702055 0.048394 -1.220927
H  3.426746 1.132123 0.163735
H  -3.702244 0.050347 1.221205
H  -3.426807 1.131907 -0.16511
H  5.59627 -1.063441 0.031093
H  5.283155 -0.037912 1.447802
H  -5.283142 -0.040072 -1.447507
H  -5.596382 -1.063404 -0.029233
H  5.826619 2.02327 0.080764
H  6.130779 1.003384 -1.340922
H  -5.826566 2.023236 -0.08366
H  -6.130888 1.005548 1.339564
H  7.700592 0.852978 1.321038
H  8.005567 -0.165023 -0.100219
H  -8.005691 -0.164619 0.100567
H  -7.700548 0.851144 -1.322255
H  8.58245 1.908939 -1.466109
H  9.636503 1.766149 -0.029742
H  8.280543 2.930387 -0.032969
H  -8.582401 1.911574 1.4632
H  -9.636476 1.766536 0.027071
H  -8.280446 2.930697 0.028417
