program: Gaussian 09
title: 000175395
version: EM64L-G09RevD.01
frameworkgroup: C1[X(C19H18ClN7OS)]
method: RPBEPBE
basis: SDD
operation: Freq
keyword: #p
keyword: freq=noraman
keyword: PBEPBE/SDD
title: #p freq=noraman PBEPBE/SDD
converged: YES YES NO NO
title: Mulliken charges:
elementType: Cl S O N N N N N N N C C C C C C C C C C C C C C C C C C C H H H H H H H H H H H H H H H H H H
charge: -0.019187 0.419355 -0.274626 -0.143824 -0.456036 -0.107967 -0.030662 -0.002894 -0.381122 -0.075140 0.524548 -0.452256 -0.530700 -0.489787 -0.353218 0.308841 -0.416444 -0.040990 -0.280805 0.059396 -0.142127 0.228659 -0.469574 -0.810462 -0.448205 0.168516 0.227877 -0.734500 -0.142336 0.253906 0.274872 0.245347 0.246523 0.320504 0.241214 0.249580 0.296805 0.280394 0.258991 0.394234 0.264618 0.296863 0.249358 0.249652 0.242851 0.257032 0.242923
chargesum: 0.00000
title: Mulliken charges with hydrogens summed into heavy atoms:
elementType: Cl S O N N N N N N N C C C C C C C C C C C C C C C C C C C
charge: -0.019187 0.419355 -0.274626 -0.143824 -0.061802 -0.107967 -0.030662 -0.002894 -0.381122 -0.075140 0.524548 0.076523 -0.038829 -0.169283 -0.112004 0.308841 0.129941 -0.040990 -0.000411 0.318387 -0.142127 0.228659 -0.204956 -0.014589 -0.448205 0.168516 0.227877 0.008306 -0.142336
polarizability: 6.52056627e+02 -4.34917191e+01 3.64191527e+02 4.43488062e+00 2.59200847e+01 1.54317887e+02
1716.lowfreq: -0.0007 -0.0005 0.0014 1.5053 3.5783 6.4195 15.6191 18.4204 22.8418
frequency: 15.6163 18.2804 22.8343 28.5128 32.4922 46.8367 58.4130 66.0121 74.7589 86.8102 100.3132 109.8907 111.4536 115.6168 122.9833 125.8269 140.5677 155.0021 161.3107 171.1442 194.8278 205.5718 225.2981 238.9863 257.3020 266.0098 285.3790 303.0641 305.0532 327.2147 347.0782 357.8099 366.9300 384.8187 418.5439 441.1424 465.3862 476.9937 484.1982 486.0670 504.8257 508.4491 534.8034 550.1735 553.0659 583.4283 589.3368 597.3212 640.0331 649.9894 676.3641 683.7259 706.8848 735.5046 745.5076 755.6076 771.5852 789.3064 809.4077 828.5680 868.2864 900.8250 916.2709 927.7852 931.0045 944.1262 956.9241 964.6865 978.2648 985.7499 995.5523 1001.9078 1024.2359 1040.4369 1048.4298 1052.1083 1054.2663 1081.1429 1121.3334 1148.2362 1187.0639 1198.5381 1214.6943 1225.3312 1232.1934 1251.0880 1274.4329 1276.4160 1286.1804 1290.6290 1306.7853 1321.4991 1342.9539 1357.6254 1360.6645 1379.1309 1389.7321 1392.6096 1396.6361 1399.2703 1444.1569 1451.7991 1455.7205 1462.9528 1474.3583 1475.0400 1478.8126 1487.5668 1497.7549 1502.3274 1521.7982 1544.6156 1610.8783 1622.8778 1641.7061 2155.0681 2201.9957 2992.6726 2993.0621 2997.7305 3004.6350 3025.8584 3053.6005 3062.7029 3075.9501 3089.1670 3089.4068 3115.2160 3122.3661 3134.4201 3163.0188 3172.2037 3187.7635 3194.6442 3404.8941
redmass: 9.3553 5.9229 9.8840 6.4267 10.2814 6.7603 2.8191 5.9357 3.8589 3.5146 2.5984 4.9121 1.3155 3.6357 3.7245 1.7049 4.2960 5.2387 6.3047 6.3103 7.7030 6.0018 4.9120 5.6439 5.7585 5.6969 3.8153 7.2251 5.5476 3.6528 4.5792 4.9008 4.0825 5.0209 4.5836 5.3424 10.7597 3.8943 6.1504 4.8052 7.4672 5.7270 4.3404 5.6792 6.4661 4.4301 4.0253 4.4762 6.0980 3.8799 7.7688 5.7513 7.0025 5.0434 2.6263 3.9419 1.6171 1.8550 1.7268 6.5924 1.1345 4.5648 1.4100 1.3334 4.1169 3.8504 1.9568 5.8342 1.3425 2.3898 2.2838 3.8233 1.6960 1.5044 3.1070 1.6250 2.9207 2.4689 2.5374 1.8793 1.4466 3.0515 1.4648 2.2749 1.8679 1.4628 1.1994 1.3370 4.1674 1.3455 1.5440 3.5365 1.2628 2.0766 1.9011 4.3132 2.8336 3.0334 1.4205 1.2309 1.8888 1.1302 2.5040 1.0442 1.1420 1.1080 1.1572 2.0027 2.9265 1.7452 1.9121 4.4246 4.5036 6.6031 6.5687 12.5973 12.4358 1.0621 1.0373 1.0360 1.0600 1.0604 1.1005 1.1003 1.0981 1.0966 1.1057 1.1029 1.0991 1.0925 1.0881 1.0959 1.0950 1.0916 1.0781
irintensity: 0.1177 0.2774 0.4317 0.2350 2.3013 0.8027 9.2062 3.1629 2.3443 2.9568 0.1680 4.5313 1.2739 0.5687 2.7132 0.4700 0.9164 4.8370 0.4306 10.4253 0.6765 1.1605 0.0630 1.1712 7.4340 4.8989 2.8546 5.3273 4.7666 3.5354 1.5008 5.2764 1.6547 0.2814 1.7242 8.6981 2.6467 16.3884 8.4352 6.2802 3.9625 11.4560 3.0993 4.0875 3.6179 4.1800 7.2254 8.0027 7.1040 1.6695 36.8323 3.2317 0.0359 21.9845 46.2586 0.5263 33.3144 15.8588 33.0815 4.7492 56.8657 49.5787 36.4600 80.2716 13.9278 6.9987 30.5792 20.7276 5.9107 39.3872 71.8551 33.6983 27.4242 3.8579 36.8350 15.1303 47.9790 4.8888 12.1243 33.3212 6.9175 28.1522 147.5378 118.4638 247.8513 332.7954 7.6506 49.8264 235.9327 17.1581 194.9238 736.7447 40.4844 43.3569 84.8121 115.8825 67.8497 143.7939 16.4014 37.2592 11.1029 27.9205 271.8606 19.0623 40.5132 7.5891 32.3014 50.7385 41.8111 106.7867 141.9566 275.7684 50.1459 934.0136 54.4087 77.3789 18.9292 41.8328 9.3803 13.2772 5.2031 34.2985 8.0378 0.6268 10.6295 6.7602 9.0000 0.7571 7.6751 3.1842 0.7240 12.4924 14.4998 17.6708 70.5739
temp: 298.150 k
press: 1.00000 atm
elementType: 17 16 8 7 7 7 7 7 7 7 6 6 6 6 6 6 6 6 6 6 6 6 6 6 6 6 6 6 6 1 1 1 1 1 1 1 1 1 1 1 1 1 1 1 1 1 1
symmnumber: 1
zpe: 901685.4 jmol-1
zpe.correction: 0.343434 hartree
zpe.thermalcorrener: 0.372968 hartree
zpe.thermalcorrenthalpy: 0.373912 hartree
zpe.thermalcorrgfe: 0.278516 hartree
zpe.sumelectzpe: -2049.271509 hartree
zpe.sumelectthermal: -2049.241975 hartree
zpe.sumelectthermalent: -2049.241031 hartree
zpe.sumelectthermalfe: -2049.336427 hartree
dipole: -2.1394 -3.1433 -2.2768
dipole: 4.4318
quadrupole: -195.1731 -216.2173 -180.2359
quadrupole: 34.2078 13.0916 3.8982
quadrupole: 2.0357 -19.0085 16.9728 34.2078 13.0916 3.8982
hfenergy: -2049.6149433 hartree
pointgroup: C01 [X(C19H18Cl1N7O1S1)]
dipole: -0.7967617 1.327912 0.8012701 debye
polarizability: 655.7055544|22.2228078|361.3993618|22.3226457|18.7019192|153.4611243 unknown
InChI: InChI=1S/C19H18ClN7OS/c1-13-16(12-22)19(29-26-13)25-24-17-6-5-15(11-18(17)23-14(2)28)27(9-3-7-20)10-4-8-21/h3,5-7,11,23H,4,9-10H2,1-2H3
charge 0 multiplicity 1
47 atoms
Cl -4.767459 5.239999 -1.803103
S  5.10245 2.767739 0.756073
O  -1.109477 -3.384555 -0.588918
N  -3.665794 0.577058 0.173406
N  0.606776 -1.805051 -0.319177
N  1.967575 0.455978 0.193911
N  2.669325 1.561329 0.454785
N  -6.374369 -3.530134 0.277301
N  6.612632 1.779921 0.571934
N  3.954565 -2.197009 -0.336268
C  -2.270938 0.57985 0.17167
C  -4.436616 -0.613725 -0.231897
C  -4.454491 1.768471 0.572538
C  -1.554544 -0.623529 -0.096165
C  -1.533858 1.791124 0.444894
C  -0.14683 -0.643579 -0.081333
C  -4.628678 -1.630805 0.942026
C  0.588849 0.575028 0.202237
C  -0.14465 1.776363 0.456303
C  -4.680839 2.747992 -0.572287
C  -5.584813 -2.69041 0.585441
C  0.128427 -3.102996 -0.561617
C  -4.460338 4.073458 -0.451586
C  1.203162 -4.152561 -0.792422
C  4.035861 1.349967 0.430512
C  4.843734 0.207273 0.198547
C  6.263514 0.504809 0.289938
C  7.358797 -0.512027 0.092813
C  4.337537 -1.08817 -0.090478
H  -5.429455 -0.281761 -0.581999
H  -3.947888 -1.118525 -1.082286
H  -3.977969 2.271474 1.432641
H  -5.435715 1.402136 0.931157
H  -2.054607 -1.568231 -0.305732
H  -2.057454 2.735342 0.605164
H  -5.004923 -1.099261 1.836755
H  -3.659983 -2.087336 1.213344
H  0.427645 2.688481 0.649459
H  -5.050817 2.329491 -1.51678
H  1.628098 -1.663644 -0.288993
H  -4.090563 4.576575 0.446259
H  2.228205 -3.763561 -0.689993
H  1.049024 -4.98032 -0.07858
H  1.072755 -4.575595 -1.804439
H  7.272504 -1.329326 0.831649
H  8.341272 -0.029113 0.207511
H  7.296761 -0.965732 -0.912913
