program: Gaussian 09
title: 000016378
version: EM64L-G09RevD.01
frameworkgroup: C1[X(C7H5Cl3)]
method: RPBEPBE
basis: SDD
operation: Freq
keyword: #pfreq=noraman
keyword: PBEPBE/SDD
title: #p freq=noraman PBEPBE/SDD
converged: YES YES NO NO
title: Mulliken charges:
elementType: Cl Cl Cl C C C C C C C H H H H H
charge: 0.002236 -0.046529 -0.002935 0.613706 -0.218329 -0.323665 -0.771905 -0.100480 -0.219296 -0.216096 0.253813 0.253689 0.243749 0.265501 0.266540
chargesum: 0.00000
title: Mulliken charges with hydrogens summed into heavy atoms:
elementType: Cl Cl Cl C C C C C C C
charge: 0.002236 -0.046529 -0.002935 0.613706 -0.218329 -0.323665 -0.020653 -0.100480 0.046205 0.050444
polarizability: 1.47180379e+02 1.22652032e+00 1.12760511e+02 -4.27175756e-03 7.17199495e-03 4.26736483e+01
1716.lowfreq: -6.1242 -3.2638 0.0026 0.0030 0.0037 7.7982 90.5270 97.4094 109.8730
frequency: 90.5269 97.3870 109.8552 194.4227 208.8113 239.8053 294.3326 296.0825 314.7754 372.0762 459.6932 510.0395 547.1110 550.7876 568.5035 708.7984 740.9572 801.6525 850.3538 938.4479 1011.1596 1042.1938 1046.8365 1127.2516 1171.4923 1215.9120 1350.2023 1375.3631 1400.5702 1422.0805 1466.7789 1469.2523 1555.8973 1582.3203 2997.1391 3074.2415 3126.0833 3167.6349 3186.5191
redmass: 9.9057 2.6283 1.2702 28.4278 17.0036 4.1194 3.9268 6.7457 17.2520 10.0367 5.0944 3.7375 5.1060 6.0588 6.8961 5.1513 7.2266 1.3394 5.9498 1.3420 1.5382 1.4903 7.4358 1.8597 1.8379 2.2635 7.0596 4.9392 1.3026 2.1525 1.1665 1.0441 6.1932 8.7460 1.0383 1.0974 1.0980 1.0889 1.0981
irintensity: 0.2851 0.1877 1.6737 0.0648 0.6432 6.9695 1.8639 0.0225 0.1672 3.9107 10.2772 0.0190 5.8838 22.7841 5.2140 0.1621 32.4072 45.5217 19.9112 0.0000 63.7665 5.1311 55.0971 2.9396 25.4351 1.0064 9.9673 39.3837 31.9294 40.2150 38.7710 16.5581 10.4882 2.2799 8.6743 9.7292 5.4512 0.1379 0.5793
temp: 298.150 k
press: 1.00000 atm
elementType: 17 17 17 6 6 6 6 6 6 6 1 1 1 1 1
symmnumber: 1
zpe: 255303.1 jmol-1
zpe.correction: 0.097240 hartree
zpe.thermalcorrener: 0.107122 hartree
zpe.thermalcorrenthalpy: 0.108066 hartree
zpe.thermalcorrgfe: 0.060846 hartree
zpe.sumelectzpe: -1649.201150 hartree
zpe.sumelectthermal: -1649.191268 hartree
zpe.sumelectthermalent: -1649.190324 hartree
zpe.sumelectthermalfe: -1649.237544 hartree
dipole: -1.0404 -0.6038 -0.0007
dipole: 1.2029
quadrupole: -84.9520 -70.3705 -80.6092
quadrupole: -1.3887 0.0002 0.0006
quadrupole: -6.3081 8.2734 -1.9653 -1.3887 0.0002 0.0006
hfenergy: -1649.2983898 hartree
pointgroup: C01 [X(C7H5Cl3)]
dipole: 0.386258 -0.2732657 0.0100237 debye
dipolederiv: -0.2513501 0.2722166 -0.0068691 0.2977046 -0.5190018 0.010481 -0.0072003 0.0099058 -0.0274854 -0.8192637 0.0442205 -0.0140009 0.0271753 -0.12955 0.0012235 -0.0137678 0.0014359 -0.0578541 -0.7479936 -0.0905219 -0.012017 -0.0679149 -0.0729914 -0.0007818 -0.0121737 -0.0011653 -0.0300041 -0.3018947 0.2830146 -0.0093274 0.2179205 0.0901068 0.0037259 -0.008789 0.0045855 0.059754 0.1564279 -0.591937 0.0104401 -0.3911359 0.6810927 -0.015169 0.0085164 -0.0186153 -0.0802454 1.1681612 -0.0730528 0.0229508 -0.1162053 0.0570998 -0.0037012 0.0232468 -0.0028163 -0.0913417 0.0126052 -0.0165479 -0.0003529 -0.0863781 -0.1872141 0.0008365 0.0007063 0.0026578 0.0455801 1.0292079 0.2635851 0.0165071 0.0852666 -0.0822883 0.0019579 0.0182941 0.0051835 -0.0425458 -0.2198621 -0.0161624 -0.0019666 0.0075463 -0.0101602 -0.000785 -0.002196 -0.0011708 -0.0949041 -0.2109394 -0.0587808 -0.0012306 -0.0037382 -0.0163023 -0.0009881 -0.001875 -0.0020698 -0.1075561 0.0851316 0.0018183 -0.0704198 -0.0152226 0.0285201 0.0664814 -0.0287725 0.0876194 -0.0193584 0.080718 0.0076832 0.0748356 -0.0114368 0.025281 -0.0679339 0.033179 -0.0883408 -0.011083 -0.0736213 -0.0398523 -0.0039453 0.051 0.1169464 0.0012602 -0.0047287 -0.0007917 0.1176159 0.0453773 0.06068 -0.0028606 0.0460905 0.0130943 0.0024286 -0.0026502 0.0026835 0.1691711 0.0472957 -0.046363 -0.0017433 -0.0406719 0.005367 0.0009641 -0.0017895 0.0008987 0.170257 unknown
polarizability: 146.6498756|-4.264773|113.248443|1.913921|-0.7974457|42.7162196 unknown
InChI: InChI=1S/C7H5Cl3/c1-4-5(8)2-3-6(9)7(4)10/h2-3H,1H3
charge 0 multiplicity 1
15 atoms
Cl -1.658864 2.198446 -0.056558
Cl 3.243058 -0.50244 0.059188
Cl -3.178513 -0.677183 -0.054311
C  0.72026 0.749908 0.001857
C  -0.700731 0.658422 -0.023275
C  1.416196 -0.485507 0.026757
C  1.410724 2.095634 0.00136
C  -1.371219 -0.582936 -0.02282
C  0.769589 -1.736834 0.027744
C  -0.638005 -1.78575 0.002821
H  1.137288 2.67491 -0.898804
H  1.098052 2.695522 0.874778
H  2.503983 1.980326 0.026766
H  1.354287 -2.659815 0.04771
H  -1.162605 -2.744702 0.003288
