program: Gaussian 09
title: 000175307
version: EM64L-G09RevD.01
frameworkgroup: C1[X(C15H19N)]
method: RPBEPBE
basis: SDD
operation: Freq
keyword: #pfreq=noraman
keyword: PBEPBE/SDD
title: #p freq=noraman PBEPBE/SDD
converged: YES YES NO NO
title: Mulliken charges:
elementType: N C C C C C C C C C C C C C C C H H H H H H H H H H H H H H H H H H H
charge: -0.025342 0.058821 -0.194609 -0.464050 -0.459383 -0.464447 -0.463829 -0.406296 0.553344 -0.712778 -0.462606 -0.379415 -0.366781 -0.396829 0.392138 -0.261734 0.184539 0.206585 0.213577 0.191013 0.193416 0.202999 0.218244 0.199352 0.199227 0.217560 0.198077 0.196051 0.209826 0.219048 0.216981 0.241763 0.237704 0.254411 0.253423
chargesum: 0.00000
title: Mulliken charges with hydrogens summed into heavy atoms:
elementType: N C C C C C C C C C C C C C C C
charge: -0.025342 0.243360 0.011976 -0.059460 -0.062969 -0.046851 -0.047043 -0.012168 0.553344 -0.066923 -0.220842 -0.141710 -0.112370 -0.143406 0.392138 -0.261734
polarizability: 2.57115446e+02 6.53721164e+00 1.28798496e+02 -7.24384308e-01 -1.37623264e+01 1.19035075e+02
1716.lowfreq: -27.5353 -7.3652 -0.0007 -0.0006 0.0002 7.1598 29.2615 38.2527 54.8095
frequency: 27.4412 37.9522 53.6921 79.9281 118.7366 134.3787 170.6806 192.4637 205.8295 221.3853 241.2735 289.7412 302.8018 371.0205 401.2873 419.1763 441.0945 450.9042 476.7223 493.8807 537.6209 549.1388 575.2167 642.1926 729.0534 746.3786 750.9454 782.0000 783.6579 833.9883 847.3098 852.7193 879.0799 895.1796 915.1160 946.2588 972.3203 976.8969 981.1199 1010.5287 1012.1522 1043.6858 1051.6829 1063.0285 1089.9674 1101.8378 1113.3557 1147.5981 1158.3289 1187.5222 1205.1713 1210.5924 1216.9251 1225.3554 1243.0851 1266.3567 1280.9692 1287.4672 1300.5320 1314.0885 1314.8956 1327.0715 1330.5883 1344.0226 1348.2294 1358.9253 1379.8442 1391.8367 1414.2845 1456.2104 1459.7691 1464.5292 1467.5438 1469.9630 1478.5511 1486.9198 1496.9534 1563.5896 1616.8859 2176.0986 2928.0702 2952.5348 2955.5005 2957.4421 2962.6663 2966.8714 2973.1743 2975.9326 3007.7452 3020.3626 3030.2896 3032.6863 3039.4505 3068.7574 3074.6132 3128.2761 3132.4788 3158.2874 3162.5096
redmass: 3.9977 4.0930 4.2052 2.0181 4.6233 4.3195 3.0669 3.6127 1.8836 1.6407 2.4785 2.4348 4.0333 2.6080 2.8382 2.3124 3.0218 3.3829 2.4005 4.9961 3.6132 6.3158 2.8025 7.2253 3.7191 2.2573 2.3210 1.8078 1.6418 2.2551 1.5484 1.3193 2.6792 1.3638 2.1743 1.9646 1.4167 1.7436 1.3834 1.7651 2.8571 1.9321 1.8811 1.3060 2.0920 2.4354 1.5709 2.0718 2.0477 1.4823 2.1385 1.8051 1.3285 1.6426 1.2824 1.2911 1.2680 1.4269 1.2659 1.2971 1.3050 1.3372 1.4210 1.8235 1.5401 1.6170 2.6864 1.2123 2.9717 1.0858 1.0889 1.0863 1.0835 1.0860 1.0482 1.0585 2.5249 6.5055 6.2838 12.6311 1.0810 1.0629 1.0630 1.0784 1.0628 1.0616 1.0654 1.0367 1.1004 1.0968 1.0964 1.1012 1.1022 1.0993 1.0992 1.0888 1.0879 1.0959 1.0972
irintensity: 0.2834 0.7621 1.0648 0.1152 2.0122 1.6940 1.0348 0.2545 0.2802 0.0210 0.2624 0.2582 0.3551 0.0731 0.0090 0.3619 0.5152 1.2465 0.2675 1.1260 0.2672 0.2022 24.2181 0.1482 0.3161 1.6560 0.9698 1.8808 0.6830 3.2125 52.2027 17.5771 3.4035 3.9239 1.9681 2.0880 1.8215 32.0052 0.0097 0.8533 3.8518 1.1635 0.0566 1.7170 2.1044 0.2258 8.7606 5.2370 1.2398 5.3374 0.5510 1.2814 4.4801 0.5152 0.2115 1.8845 0.2447 0.5835 0.1729 0.8755 0.3945 0.1466 0.4552 0.3440 0.2805 0.1513 0.7767 15.7403 6.5868 1.6857 7.3035 15.1867 7.8453 1.7874 9.3870 16.5422 27.9190 0.0599 40.8930 58.7379 7.8997 10.2108 21.8375 2.0813 96.9497 16.9973 51.5726 31.5346 9.1091 75.8016 36.1882 6.7185 97.0110 58.2768 59.6126 8.8733 14.8175 15.0720 0.0527
temp: 298.150 k
press: 1.00000 atm
elementType: 7 6 6 6 6 6 6 6 6 6 6 6 6 6 6 6 1 1 1 1 1 1 1 1 1 1 1 1 1 1 1 1 1 1 1
symmnumber: 1
zpe: 787927.4 jmol-1
zpe.correction: 0.300106 hartree
zpe.thermalcorrener: 0.315454 hartree
zpe.thermalcorrenthalpy: 0.316398 hartree
zpe.thermalcorrgfe: 0.256526 hartree
zpe.sumelectzpe: -636.559131 hartree
zpe.sumelectthermal: -636.543783 hartree
zpe.sumelectthermalent: -636.542839 hartree
zpe.sumelectthermalfe: -636.602711 hartree
dipole: 5.8444 0.7983 -0.2476
dipole: 5.9038
quadrupole: -138.1866 -93.5565 -95.3928
quadrupole: -4.9205 2.5346 -4.7555
quadrupole: -29.1413 15.4888 13.6525 -4.9205 2.5346 -4.7555
hfenergy: -636.8592368 hartree
pointgroup: C01 [X(C15H19N1)]
dipole: -2.3025699 -0.2526973 -0.1717272 debye
polarizability: 257.2436724|4.5611829|121.3932234|2.4392479|14.373499|126.3121212 unknown
InChI: InChI=1S/C15H19N/c1-2-12-3-7-14(8-4-12)15-9-5-13(11-16)6-10-15/h5-6,9-10,12,14H,2-4,7-8H2,1H3
charge 0 multiplicity 1
35 atoms
N  6.213721 0.429212 0.304462
C  -3.615787 0.053401 0.332151
C  -0.715166 -0.448728 -0.385752
C  -2.957266 0.682408 -0.922352
C  -2.889787 -1.26867 0.694019
C  -1.434962 0.885351 -0.744957
C  -1.368311 -1.074623 0.880821
C  -5.137503 -0.180909 0.155137
C  0.788732 -0.261007 -0.229848
C  -5.973265 1.11099 0.020474
C  1.698407 -0.906955 -1.107425
C  1.324334 0.571057 0.791674
C  3.090876 -0.736844 -0.979316
C  2.711683 0.751716 0.934866
C  3.611532 0.097115 0.047346
C  5.032563 0.27786 0.187821
H  -3.474593 0.760877 1.180877
H  -0.887682 -1.152947 -1.227324
H  -3.430719 1.654157 -1.159673
H  -3.141926 0.016365 -1.792563
H  -3.07001 -2.008959 -0.114686
H  -3.327766 -1.696426 1.617719
H  -0.993382 1.309924 -1.667184
H  -1.2545 1.624073 0.062872
H  -1.187183 -0.411392 1.751523
H  -0.881048 -2.041723 1.111034
H  -5.508607 -0.758162 1.027027
H  -5.301452 -0.825032 -0.734253
H  -5.813012 1.776714 0.889898
H  -5.71123 1.67931 -0.890522
H  -7.053326 0.881503 -0.032543
H  1.307126 -1.551839 -1.903165
H  0.648071 1.084688 1.484487
H  3.778914 -1.242083 -1.664676
H  3.110326 1.39478 1.726133
