program: Gaussian 09
title: 000175296
version: EM64L-G09RevD.01
frameworkgroup: C1[X(C13H19N)]
method: RPBEPBE
basis: SDD
operation: Freq
keyword: #pfreq=noraman
keyword: PBEPBE/SDD
title: #p freq=noraman PBEPBE/SDD
converged: YES YES NO NO
title: Mulliken charges:
elementType: N C C C C C C C C C C C C C H H H H H H H H H H H H H H H H H H H
charge: -0.022481 -0.173213 -0.145972 -0.463044 0.449002 -0.556960 -0.438997 -0.389527 -0.836176 -0.316238 -0.207167 0.386720 -0.788012 -0.804838 0.227514 0.268769 0.226300 0.216763 0.228938 0.219658 0.238583 0.214119 0.210070 0.219035 0.228239 0.230345 0.225672 0.219397 0.219834 0.227904 0.235511 0.222159 0.228095
chargesum: 0.00000
title: Mulliken charges with hydrogens summed into heavy atoms:
elementType: N C C C C C C C C C C C C C
charge: -0.022481 0.054301 0.122797 -0.019981 0.449002 -0.108364 0.013704 -0.179457 -0.158557 -0.090566 -0.207167 0.386720 -0.120878 -0.119072
polarizability: 1.75136199e+02 3.13926385e+00 1.26954779e+02 1.08466668e+01 2.81099081e+00 1.23647239e+02
1716.lowfreq: -21.5362 -7.5594 -5.8536 -0.0007 -0.0001 0.0005 20.2469 30.9298 66.6977
frequency: 18.1481 30.6822 66.6296 83.5541 110.5703 121.3035 131.2335 148.9098 177.7339 210.2417 222.9417 265.2593 299.7645 307.0970 327.8242 371.4655 388.9133 418.8295 446.5474 460.7666 540.4918 570.4661 576.3142 581.6911 679.6809 738.1200 780.2511 807.9795 828.8986 846.8977 875.9010 904.8858 934.7393 949.6280 966.5310 979.9367 990.5314 1022.5609 1024.6460 1047.7816 1056.5753 1078.7702 1082.3716 1110.5930 1121.0797 1146.6200 1172.4366 1180.7596 1183.7944 1235.7914 1260.9600 1268.1849 1285.8173 1304.6404 1327.6135 1340.0143 1346.3422 1352.0418 1364.8660 1390.6333 1395.7633 1401.1675 1454.3057 1457.6197 1460.6925 1462.6185 1467.1147 1470.8755 1472.2083 1475.5582 1488.4541 1684.9852 1689.5740 2183.3043 2959.6487 2959.7637 2961.6233 2965.7032 2977.0933 2991.4338 2994.8148 3001.7446 3016.1028 3030.3271 3031.5665 3035.2795 3044.3165 3061.8990 3078.4906 3079.0258 3084.6787 3090.6876 3098.9982
redmass: 3.2961 3.5236 3.2737 2.9783 3.0224 2.4892 1.3508 1.2202 1.2334 2.8888 2.5589 2.2684 2.6691 2.5337 2.4940 2.6679 3.5025 2.7307 4.5845 2.3873 3.1773 4.3119 4.3872 3.1328 2.1264 3.0656 3.1993 1.4645 1.5428 1.6366 2.1651 2.6774 2.0965 1.3832 2.2370 2.2091 1.2529 2.1185 1.7847 1.6117 2.1897 2.1549 1.6810 1.4031 1.9310 1.9223 1.5675 1.2561 1.8656 1.7872 1.2941 1.3235 1.3200 1.2982 1.3798 1.4701 1.6730 1.4401 1.7164 1.3024 1.2295 1.2334 1.0579 1.0734 1.0732 1.0494 1.0680 1.0675 1.0684 1.0619 1.0802 6.3073 6.7991 12.5512 1.0378 1.0373 1.0630 1.0384 1.0815 1.0725 1.0634 1.0787 1.0850 1.0967 1.0969 1.0963 1.0999 1.1031 1.0975 1.0976 1.0918 1.0965 1.0905
irintensity: 0.3993 1.0428 1.2158 0.7895 1.7216 2.0290 0.8711 1.7899 1.8048 0.4991 1.0191 2.0099 0.9221 1.5978 0.5714 1.2105 0.0288 4.1898 0.1687 4.8965 1.7327 1.0313 6.9172 3.0610 1.1360 3.0103 0.8262 17.5046 32.5018 0.5924 6.9853 5.5114 1.3880 1.1100 0.1196 2.3119 7.5487 8.1539 2.8761 1.1392 5.1100 1.6854 3.7574 3.7894 19.7068 0.2516 0.6335 5.0680 6.6850 2.8743 5.1478 2.3546 5.5642 1.3025 1.1773 1.2429 1.3496 1.5263 2.8475 22.4784 16.3139 15.1180 1.2122 0.9543 12.9773 16.2783 24.7975 15.1433 7.5625 17.5953 13.7702 9.5326 0.2326 17.1494 32.4482 36.4327 34.9907 40.6687 17.7981 2.1382 35.6711 16.3842 46.3128 26.1747 3.7258 47.6876 25.4349 31.6880 29.8785 7.2510 46.5428 40.2080 37.7401
temp: 298.150 k
press: 1.00000 atm
elementType: 7 6 6 6 6 6 6 6 6 6 6 6 6 6 1 1 1 1 1 1 1 1 1 1 1 1 1 1 1 1 1 1 1
symmnumber: 1
zpe: 747030.2 jmol-1
zpe.correction: 0.284529 hartree
zpe.thermalcorrener: 0.300309 hartree
zpe.thermalcorrenthalpy: 0.301253 hartree
zpe.thermalcorrgfe: 0.240280 hartree
zpe.sumelectzpe: -560.418575 hartree
zpe.sumelectthermal: -560.402795 hartree
zpe.sumelectthermalent: -560.401850 hartree
zpe.sumelectthermalfe: -560.462824 hartree
dipole: 2.1396 1.8876 -3.0499
dipole: 4.1764
quadrupole: -82.7744 -88.0950 -93.7720
quadrupole: -5.1239 10.1079 10.0644
quadrupole: 5.4394 0.1188 -5.5582 -5.1239 10.1079 10.0644
hfenergy: -560.7031038 hartree
pointgroup: C01 [X(C13H19N1)]
dipole: 0.8729758 0.9305752 -1.0352877 debye
polarizability: 174.8704225|0.1385384|125.8236296|11.9234125|2.9991595|125.044165 unknown
InChI: InChI=1S/C13H19N/c1-10(2)7-8-13-11(3)5-4-6-12(13)9-14/h5,7,12-13H,4,6,8H2,1-3H3
charge 0 multiplicity 1
33 atoms
N  -1.875696 -2.349471 1.751439
C  -0.224668 0.365836 0.159927
C  -0.765414 -1.032779 -0.291146
C  -1.781423 -0.880634 -1.462167
C  -1.359987 1.37587 0.339029
C  0.870397 0.895264 -0.836337
C  -2.993585 -0.022364 -1.040208
C  -2.590296 1.185387 -0.214726
C  -1.047592 2.592991 1.190729
C  2.082215 -0.012307 -0.969422
C  -1.379539 -1.756577 0.841394
C  3.161302 -0.053947 -0.133086
C  4.306184 -1.02349 -0.374698
C  3.32158 0.835186 1.088064
H  0.281573 0.232129 1.138261
H  0.097704 -1.641275 -0.626906
H  -2.113007 -1.875279 -1.811066
H  -1.252858 -0.396354 -2.304553
H  0.404366 1.043092 -1.828709
H  1.178661 1.900083 -0.492241
H  -3.706136 -0.638319 -0.452241
H  -3.549191 0.304262 -1.941482
H  -3.374343 1.934211 -0.031257
H  -0.1943 3.172958 0.78717
H  -0.770605 2.292733 2.221015
H  -1.913609 3.274065 1.256724
H  2.079204 -0.704289 -1.825288
H  5.262407 -0.481544 -0.516992
H  4.450474 -1.693769 0.496019
H  4.131644 -1.651267 -1.265734
H  2.514345 1.579053 1.190394
H  4.286633 1.377878 1.050255
H  3.33906 0.226266 2.01394
