program: Gaussian 09
title: 000175292
version: EM64L-G09RevD.01
frameworkgroup: C1[X(C11H15N)]
method: RPBEPBE
basis: SDD
operation: Freq
keyword: #pfreq=noraman
keyword: PBEPBE/SDD
title: #p freq=noraman PBEPBE/SDD
converged: NO YES NO NO
title: Mulliken charges:
elementType: N C C C C C C C C C C C H H H H H H H H H H H H H H H
charge: -0.034928 -0.183892 -0.128036 -0.182467 -0.510435 -0.513608 -0.461695 -0.463553 0.381710 -0.818020 -0.357379 -0.199409 0.246533 0.235578 0.240213 0.220903 0.231057 0.237659 0.197777 0.224854 0.223029 0.207167 0.229571 0.231089 0.245865 0.259417 0.241001
chargesum: 0.00000
title: Mulliken charges with hydrogens summed into heavy atoms:
elementType: N C C C C C C C C C C C
charge: -0.034928 0.062642 0.107541 0.057747 -0.058475 -0.078172 -0.013812 -0.026816 0.381710 -0.081650 -0.116378 -0.199409
polarizability: 1.54824847e+02 -1.11907956e+01 1.07281374e+02 8.08935940e+00 -1.06148108e-01 9.23292624e+01
1716.lowfreq: -21.5586 -8.1231 -4.6395 -0.0002 0.0004 0.0004 24.3363 70.5103 105.1873
frequency: 15.0479 70.2014 105.1520 138.9408 160.4419 201.7213 245.1509 309.3668 368.6024 388.8471 420.5507 434.7803 466.7394 519.8827 552.0823 641.4411 730.2506 747.9445 783.6623 804.3081 826.7352 855.4674 872.0196 896.7902 924.8556 936.6854 948.9426 961.2885 975.3996 991.6098 1016.6518 1021.7385 1034.4868 1057.7310 1079.1349 1114.5638 1120.5778 1137.8757 1169.3649 1189.5147 1204.7291 1236.6229 1244.8893 1249.4934 1267.5214 1282.3187 1292.2565 1297.0481 1305.3182 1317.5471 1354.0118 1393.9520 1462.7882 1463.2459 1466.4522 1469.0026 1472.1194 1492.1737 1634.8910 2160.8934 2940.1986 2974.0439 2996.2624 3003.6630 3007.9776 3010.8606 3048.2154 3049.6452 3059.6797 3064.7008 3069.6738 3073.7828 3077.7211 3098.7286 3143.1931
redmass: 3.3168 3.4422 3.3651 4.6713 1.1216 2.9398 3.0812 2.9617 2.1205 2.8984 2.3446 4.1696 2.7131 3.1153 3.8178 3.3319 3.3833 3.0472 3.4174 1.4493 2.3646 1.6718 2.4361 3.0474 2.0313 1.9853 2.0390 2.0157 1.7870 1.9563 2.0446 1.5618 1.7997 1.5576 1.7893 1.0817 1.1569 1.6107 1.5824 1.3276 1.9329 1.3418 1.5918 1.5532 1.3937 1.3529 1.4596 1.6132 1.6070 1.4725 1.7591 1.2270 1.0815 1.0757 1.0607 1.0918 1.0869 1.0973 6.3901 12.5154 1.0817 1.0382 1.0589 1.0591 1.0610 1.0620 1.0965 1.1029 1.0900 1.1015 1.0962 1.1026 1.1042 1.0987 1.0878
irintensity: 0.2593 0.8010 2.0923 3.0589 1.7246 0.8401 0.8966 0.2633 0.5538 2.2097 1.5247 0.2567 1.7023 2.7762 1.3426 1.0301 2.8458 0.6534 1.6279 4.0891 6.0711 14.5814 7.0766 3.0779 0.8714 4.7523 2.5443 1.3874 1.4762 0.8243 1.5455 0.1469 1.5188 0.2510 2.7608 0.3623 0.8252 0.7184 17.3718 3.3619 5.3695 6.3408 4.7749 1.4618 0.4685 1.3191 1.5365 2.8117 7.4309 2.1792 0.3555 30.5314 1.3761 24.3234 17.2321 9.9761 14.0650 5.2191 52.3968 51.0487 18.8500 14.1833 31.2368 51.5821 33.0648 48.6708 17.2647 6.2421 74.8709 16.9845 1.9383 46.1727 89.2906 14.5459 2.5370
temp: 298.150 k
press: 1.00000 atm
elementType: 7 6 6 6 6 6 6 6 6 6 6 6 1 1 1 1 1 1 1 1 1 1 1 1 1 1 1
symmnumber: 1
zpe: 609630.0 jmol-1
zpe.correction: 0.232196 hartree
zpe.thermalcorrener: 0.243530 hartree
zpe.thermalcorrenthalpy: 0.244474 hartree
zpe.thermalcorrgfe: 0.193796 hartree
zpe.sumelectzpe: -481.981136 hartree
zpe.sumelectthermal: -481.969801 hartree
zpe.sumelectthermalent: -481.968857 hartree
zpe.sumelectthermalfe: -482.019536 hartree
dipole: -5.1686 1.3409 -1.0244
dipole: 5.4371
quadrupole: -97.4622 -69.3551 -72.5610
quadrupole: 4.6856 -3.2692 0.9177
quadrupole: -17.6694 10.4376 7.2318 4.6856 -3.2692 0.9177
hfenergy: -482.2133318 hartree
pointgroup: C01 [X(C11H15N1)]
dipole: -2.0843949 -0.4783867 -0.0473303 debye
polarizability: 156.6914079|8.6424606|101.5450158|2.9862552|7.1069902|96.1990598 unknown
InChI: InChI=1S/C11H15N/c1-8(4-5-12)11-7-9-2-3-10(11)6-9/h4,9-11H,2-3,6-7H2,1H3
charge 0 multiplicity 1
27 atoms
N  4.42264 0.388186 0.31784
C  -1.402148 -0.740454 -0.774932
C  -2.394175 0.694471 0.695686
C  -0.475894 -0.838595 0.500325
C  -2.794951 -0.578577 -0.104357
C  -1.139119 0.202912 1.478877
C  -1.206392 0.650014 -1.450088
C  -1.912936 1.638075 -0.447267
C  1.011801 -0.74011 0.197502
C  1.5412 -1.760284 -0.791351
C  1.839816 0.186729 0.780544
C  3.245366 0.282256 0.516884
H  -1.292752 -1.596129 -1.461057
H  -3.174659 1.132275 1.339263
H  -0.629955 -1.859269 0.914851
H  -3.072054 -1.433357 0.539588
H  -3.60594 -0.396685 -0.83211
H  -1.420866 -0.279872 2.431882
H  -0.482028 1.054471 1.7262
H  -1.693907 0.667142 -2.441494
H  -0.140039 0.895244 -1.600372
H  -1.228191 2.421103 -0.074227
H  -2.770324 2.146488 -0.924832
H  1.205783 -2.778369 -0.516298
H  1.144392 -1.559396 -1.805164
H  2.641587 -1.755016 -0.849245
H  1.451344 0.914847 1.500251
