program: Gaussian 09
title: 000175230
version: EM64L-G09RevD.01
frameworkgroup: C1[X(C11H20S)]
method: RPBEPBE
basis: SDD
operation: Freq
keyword: #pfreq=noraman
keyword: PBEPBE/SDD
title: #p freq=noraman PBEPBE/SDD
converged: YES YES NO NO
title: Mulliken charges:
elementType: S C C C C C C C C C C C H H H H H H H H H H H H H H H H H H H H
charge: 0.145573 -0.523833 -0.473122 0.472206 -0.303867 -0.268167 0.413109 -0.830394 -0.740015 -0.792354 -0.796193 -0.849039 0.192585 0.217093 0.206643 0.203092 0.210743 0.230306 0.226894 0.230825 0.224451 0.256862 0.256202 0.229757 0.210354 0.222055 0.210077 0.213005 0.246232 0.253514 0.252448 0.252959
chargesum: 0.00000
title: Mulliken charges with hydrogens summed into heavy atoms:
elementType: S C C C C C C C C C C C
charge: 0.145573 -0.114155 -0.063387 0.472206 -0.093125 -0.037861 0.413109 -0.148224 -0.226951 -0.130188 -0.126880 -0.090118
polarizability: 1.62393489e+02 -2.22325158e+01 1.43502396e+02 -1.25769815e+00 2.25253896e+00 1.11772150e+02
1716.lowfreq: -14.8385 -3.2797 -0.0009 0.0010 0.0015 10.6275 37.6590 42.5857 44.9065
frequency: 37.1128 42.4365 44.3333 50.1621 72.8557 83.2222 93.4568 139.6887 156.5395 166.1247 178.0892 199.6394 234.3197 295.0868 309.1576 326.7661 360.8948 383.9325 412.7642 466.6757 504.1879 511.7591 556.2755 641.5785 660.0400 735.2684 775.6757 830.9056 858.6744 888.4712 904.3360 931.3221 948.9659 966.2645 974.2427 979.7916 987.8692 996.4667 1033.2934 1039.1387 1084.0257 1087.0639 1121.8609 1136.3002 1155.4195 1197.5867 1225.7212 1235.4599 1240.0875 1293.8042 1322.0816 1341.7253 1358.1784 1368.2889 1387.7416 1393.7700 1398.0228 1447.6499 1452.1028 1454.6844 1456.8590 1460.7439 1461.7298 1465.8677 1472.0782 1475.4329 1479.3607 1483.3801 1680.0532 1695.6171 2956.8101 2962.5205 2963.2116 2968.7870 2979.5064 2996.5219 3012.1703 3028.0927 3030.3519 3034.3407 3038.5786 3043.7044 3069.9304 3077.9292 3082.9885 3088.8103 3094.5511 3107.3819 3111.4831 3124.5857
redmass: 3.4339 3.9315 3.5928 3.0188 1.9332 2.0901 1.7781 2.2417 1.1239 1.0336 2.7720 1.3343 2.6684 2.3450 2.8952 2.9105 2.4505 2.2223 2.4129 2.3150 2.4809 2.6101 2.2419 4.4522 7.1995 2.4033 2.8532 1.3182 1.8328 1.6435 1.5407 1.8009 1.3906 1.2365 1.3416 1.6570 2.2437 1.2552 1.7269 1.5749 1.6266 1.6365 1.8711 1.5997 1.4818 1.1725 1.7926 1.6751 1.4579 1.3202 1.4053 1.1383 1.4157 1.3378 1.3096 1.3381 1.2427 1.0604 1.0827 1.0681 1.0667 1.0604 1.0688 1.0826 1.0714 1.0523 1.0800 1.0737 6.5651 6.4672 1.0369 1.0593 1.0394 1.0402 1.0622 1.0292 1.0577 1.0993 1.0972 1.0968 1.0953 1.0966 1.0928 1.0962 1.1037 1.0955 1.0956 1.1044 1.0937 1.1021
irintensity: 0.3934 1.6372 0.4957 1.4033 1.0198 0.7913 0.2221 1.6356 0.4986 0.1282 0.3289 1.1062 1.0067 0.8855 0.0191 0.1541 2.0565 0.0960 3.0585 7.6020 4.1497 7.4485 6.0055 7.6645 1.4574 2.3318 1.3524 22.9144 12.6853 15.9541 6.0117 3.2065 0.6920 8.4111 5.8504 2.8917 2.9864 3.5168 11.0021 1.3203 3.9785 12.1536 4.2066 0.7864 5.1763 2.5012 5.9230 16.2654 4.9893 0.6290 0.3619 0.5074 0.5287 0.8838 21.9498 26.1946 11.1608 14.9795 4.2002 1.0207 9.0062 9.4559 3.2446 18.5282 7.9879 29.3381 22.7809 5.3048 12.1685 5.1284 36.4098 14.1990 55.3393 27.1850 98.7064 52.5510 31.0116 14.1243 8.0247 45.6761 20.3537 29.4805 15.4415 61.2066 12.7041 36.5146 21.3003 36.1054 21.6692 11.8853
temp: 298.150 k
press: 1.00000 atm
elementType: 16 6 6 6 6 6 6 6 6 6 6 6 1 1 1 1 1 1 1 1 1 1 1 1 1 1 1 1 1 1 1 1
symmnumber: 1
zpe: 732011.3 jmol-1
zpe.correction: 0.278808 hartree
zpe.thermalcorrener: 0.295348 hartree
zpe.thermalcorrenthalpy: 0.296292 hartree
zpe.thermalcorrgfe: 0.233203 hartree
zpe.sumelectzpe: -828.219757 hartree
zpe.sumelectthermal: -828.203218 hartree
zpe.sumelectthermalent: -828.202274 hartree
zpe.sumelectthermalfe: -828.265362 hartree
dipole: -0.9841 -1.3548 0.1860
dipole: 1.6847
quadrupole: -76.4584 -82.0912 -82.3490
quadrupole: -0.9985 -0.3003 -0.7388
quadrupole: 3.8411 -1.7917 -2.0494 -0.9985 -0.3003 -0.7388
hfenergy: -828.4985655 hartree
pointgroup: C01 [X(C11H20S1)]
dipole: -0.5090496 0.3860602 -0.1765519 debye
polarizability: 147.9126611|23.6287427|157.8460854|3.2349395|1.5300254|111.9092886 unknown
InChI: InChI=1S/C11H20S/c1-10(2)6-5-7-11(3)8-9-12-4/h6,8H,5,7,9H2,1-4H3
charge 0 multiplicity 1
32 atoms
S  -2.192141 -1.521191 -0.237918
C  1.000834 2.209587 0.535152
C  2.269933 1.355196 0.177421
C  -0.272076 1.711507 -0.138541
C  2.235822 -0.025771 0.798942
C  -1.176378 0.967544 0.565879
C  1.982599 -1.217537 0.184435
C  -0.419863 2.077281 -1.604447
C  -2.449784 0.363383 0.048864
C  1.925515 -2.51001 0.983614
C  1.705237 -1.383871 -1.299414
C  -3.990149 -2.019484 -0.500467
H  1.19693 3.259838 0.234344
H  0.876253 2.202558 1.634828
H  3.156613 1.905606 0.552663
H  2.378796 1.300087 -0.921427
H  2.398247 -0.042877 1.88892
H  -0.949388 0.7452 1.617943
H  -0.548382 3.171844 -1.721612
H  -1.27067 1.577367 -2.094647
H  0.49359 1.805024 -2.167487
H  -2.786278 0.802266 -0.904157
H  -3.261821 0.443102 0.793299
H  0.923674 -2.975827 0.89482
H  2.658018 -3.249849 0.603134
H  2.131488 -2.341009 2.055126
H  2.358354 -2.166874 -1.733155
H  1.855661 -0.45606 -1.875673
H  0.65789 -1.7108 -1.456736
H  -3.995787 -3.107051 -0.675099
H  -4.411427 -1.505355 -1.379741
H  -4.587111 -1.789422 0.397335
