program: Gaussian 09
title: 000175113
version: EM64L-G09RevD.01
frameworkgroup: C1[X(C13H7Br2ClN2O4)]
method: RPBEPBE
basis: SDD
operation: Freq
keyword: #p
keyword: freq=noraman
keyword: PBEPBE/SDD
title: #p freq=noraman PBEPBE/SDD
converged: YES YES NO NO
title: Mulliken charges:
elementType: Br Br Cl O O O O N N C C C C C C C C C C C C C H H H H H H H
charge: 0.081163 0.038656 0.056655 -0.376107 -0.375611 -0.208849 -0.169111 -0.475332 0.013756 0.553988 0.161499 0.244444 -0.630171 0.303820 -0.338764 0.574528 -0.213049 -0.158507 -0.359624 -0.396074 -0.290249 -0.150965 0.333551 0.288795 0.331179 0.209613 0.268152 0.279157 0.403456
chargesum: 0.00000
title: Mulliken charges with hydrogens summed into heavy atoms:
elementType: Br Br Cl O O O O N N C C C C C C C C C C C C C
charge: 0.081163 0.038656 0.056655 0.027349 -0.375611 -0.208849 -0.169111 -0.141781 0.013756 0.553988 0.161499 0.244444 -0.341376 0.303820 -0.007584 0.574528 -0.003436 0.109645 -0.359624 -0.396074 -0.290249 0.128192
polarizability: 4.02253327e+02 -6.98289134e+00 2.65668406e+02 2.56449654e-01 3.56651833e-01 7.28797077e+01
1716.lowfreq: -25.7795 -4.2176 -2.5328 0.0003 0.0007 0.0012 2.8859 10.9396 23.8149
frequency: -25.7681 10.8069 23.8096 40.6195 59.5815 96.4255 102.6656 119.6183 122.4254 125.5773 166.8496 174.3485 189.5960 206.6079 235.0111 259.0833 319.9165 320.8537 332.8101 345.9957 356.0801 407.8950 432.3568 435.1865 460.1865 474.4347 518.9320 532.2008 552.4034 575.4076 640.1173 650.7510 659.5792 664.6456 683.5812 692.8008 720.6312 726.5267 763.6868 770.7840 820.3191 841.0283 851.5618 878.8702 891.6058 919.7037 924.2272 939.1009 997.1863 1018.0395 1079.5483 1108.2063 1112.9218 1151.4393 1173.7268 1192.2550 1238.2007 1264.4535 1269.1531 1286.2582 1324.4151 1366.9227 1382.3445 1391.5565 1396.4570 1415.6658 1421.7313 1473.4710 1515.6673 1547.4906 1557.6796 1586.2350 1614.2137 1626.7509 2765.3186 3142.7265 3151.0183 3169.9002 3182.7624 3207.6599 3550.2745
redmass: 16.3954 12.5243 13.5912 18.5036 7.7295 7.1727 25.1365 9.0541 14.8385 7.0738 18.4902 5.1449 5.1316 15.7909 12.3387 17.3330 6.6174 10.4759 12.4051 6.7077 7.3343 8.4865 3.5532 8.7887 10.8821 5.3735 6.9278 2.8160 4.2190 6.0498 1.5209 8.3944 7.8748 9.3290 6.1034 3.9153 6.1813 10.7168 4.9748 9.5751 6.8973 1.6738 1.3498 6.8240 1.3956 7.2813 1.5540 1.0689 1.3264 6.1894 3.8883 2.1917 2.7493 1.3721 2.0747 11.4021 1.6347 2.0702 3.1108 2.1960 1.9641 4.0696 9.2500 5.1573 4.7267 3.5844 3.8607 3.1605 2.8646 7.0526 3.7402 3.5780 6.6250 3.7049 1.0703 1.0913 1.0913 1.0916 1.0933 1.0955 1.0757
irintensity: 0.0017 0.7486 0.0106 0.4935 5.3878 1.5338 0.3713 0.0387 4.1432 0.1205 1.2897 0.5266 0.0265 1.0102 1.1863 0.4019 0.2772 3.3199 1.0731 0.1190 14.7433 7.5827 1.1594 3.6300 33.4830 8.6873 5.8579 0.3538 35.7911 29.9857 37.3542 7.7667 32.4855 58.1349 0.3135 0.5069 5.2105 19.9713 30.4651 49.5009 5.5586 17.6665 26.2950 4.1696 14.9857 11.9211 31.6122 161.0764 6.2233 58.2772 16.0291 20.7087 37.7331 6.7991 170.4485 270.2714 3.1554 133.4656 48.6749 106.6013 418.6734 162.7005 15.7679 21.9764 56.2403 125.8994 138.5034 353.5643 622.6060 9.2984 87.0788 104.9772 41.8650 38.9316 635.9646 7.8245 12.8199 0.9856 0.5799 13.3032 16.3995
temp: 298.150 k
press: 1.00000 atm
elementType: 35 35 17 8 8 8 8 7 7 6 6 6 6 6 6 6 6 6 6 6 6 6 1 1 1 1 1 1 1
symmnumber: 1
zpe: 470843.3 jmol-1
zpe.correction: 0.179335 hartree
zpe.thermalcorrener: 0.198496 hartree
zpe.thermalcorrenthalpy: 0.199441 hartree
zpe.thermalcorrgfe: 0.127328 hartree
zpe.sumelectzpe: -1395.342443 hartree
zpe.sumelectthermal: -1395.323281 hartree
zpe.sumelectthermalent: -1395.322337 hartree
zpe.sumelectthermalfe: -1395.394450 hartree
dipole: 1.6828 -0.6432 -0.0246
dipole: 1.8016
quadrupole: -185.6609 -160.0858 -153.3899
quadrupole: 24.1097 0.1531 -0.0082
quadrupole: -19.2821 6.2931 12.9890 24.1097 0.1531 -0.0082
hfenergy: -1395.5217779 hartree
pointgroup: C01 [X(C13H7Br2Cl1N2O4)]
dipole: -0.6761552 -0.2124122 0.0111292 debye
polarizability: 402.5723147|-1.340683|265.2492556|-2.7843071|3.8731507|72.9798695 unknown
InChI: InChI=1S/C13H7Br2ClN2O4/c14-6-3-8(12(19)9(15)4-6)13(20)17-7-1-2-10(16)11(5-7)18(21)22/h1-5,17,19H
charge 0 multiplicity 1
29 atoms
Br -6.401359 -1.469073 -0.007033
Br -4.050575 3.830375 0.105269
Cl 5.939472 -1.581918 -0.102192
O  -3.453192 -2.295751 -0.047019
O  -0.96268 -2.038537 -0.057008
O  4.183101 2.684789 -0.031943
O  5.995471 1.311166 -0.061037
N  0.089483 0.041628 -0.027515
N  4.727298 1.509845 -0.050101
C  1.449663 -0.371113 -0.046453
C  -2.376792 -0.080788 -0.003406
C  -1.047391 -0.747622 -0.030523
C  2.427174 0.647077 -0.041633
C  -3.54067 -0.934118 -0.015264
C  1.86623 -1.73154 -0.068288
C  3.804484 0.335559 -0.057714
C  -2.546717 1.332702 0.0328
C  3.238708 -2.030489 -0.084031
C  4.226402 -1.020183 -0.079197
C  -4.831728 -0.327718 0.008312
C  -3.831638 1.886114 0.055226
C  -4.986348 1.065486 0.042934
H  -0.051529 1.052877 -0.011781
H  2.160761 1.709468 -0.025351
H  1.120364 -2.526552 -0.073174
H  -1.69325 2.018085 0.046192
H  3.560548 -3.075702 -0.100708
H  -5.98548 1.507433 0.060575
H  -2.443811 -2.536098 -0.058137
