program: Gaussian 09
title: 000175081
version: EM64L-G09RevD.01
frameworkgroup: C1[X(C21H19NO3)]
method: RPBEPBE
basis: SDD
operation: Freq
keyword: #p
keyword: freq=noraman
keyword: PBEPBE/SDD
title: #p freq=noraman PBEPBE/SDD
converged: NO YES NO NO
title: Mulliken charges:
elementType: O O O N C C C C C C C C C C C C C C C C C C C C C H H H H H H H H H H H H H H H H H H H
charge: -0.225925 -0.223096 -0.206268 -0.101067 0.440710 0.215266 -0.581802 0.037089 -0.354744 -0.487457 0.120412 0.187413 -0.369068 0.047112 0.320233 -0.429541 -0.628821 -0.372034 -0.382740 -0.240516 -0.255398 -0.243942 0.210662 -0.535066 -0.495534 0.211446 0.253434 0.291921 0.237191 0.246360 0.240996 0.213423 0.256209 0.228216 0.189585 0.279449 0.242876 0.227254 0.226855 0.228324 0.220985 0.221550 0.254783 0.283265
chargesum: 0.00000
title: Mulliken charges with hydrogens summed into heavy atoms:
elementType: O O O N C C C C C C C C C C C C C C C C C C C C C
charge: -0.225925 -0.223096 -0.206268 -0.101067 0.440710 0.215266 -0.116922 0.037089 -0.062823 -0.250267 0.120412 0.187413 -0.122707 0.047112 0.320233 0.024878 0.045188 -0.092584 -0.139864 -0.013262 -0.028543 -0.015618 0.210662 0.162253 -0.212269
polarizability: 3.89549080e+02 2.59516693e+01 2.79023286e+02 2.91666702e+00 3.64095542e+00 1.34692046e+02
1716.lowfreq: -5.5084 -0.0008 -0.0001 0.0009 3.4654 4.4669 24.3508 29.6594 39.1170
frequency: 24.3276 29.6033 39.1098 47.6084 55.9997 76.6316 89.2163 95.5845 105.4251 131.7533 150.9799 158.4580 171.4743 210.8365 235.9886 243.0351 247.5486 258.2098 269.3123 307.9712 319.9018 327.3120 347.9297 364.1013 371.8388 397.2879 402.9749 406.7691 430.3091 459.1389 500.4957 512.2858 547.8755 563.8807 576.7728 608.4613 616.1906 623.1084 636.3432 646.4792 669.7081 690.3403 697.1741 722.2958 742.7937 762.6921 777.8765 788.2659 803.1382 822.7783 848.8550 860.1312 915.0476 926.0703 929.1741 936.5848 939.6452 964.7848 970.5075 978.3118 988.1020 996.2894 1016.8644 1021.0105 1028.3562 1043.5944 1091.6000 1097.6011 1111.8845 1112.8191 1126.1733 1146.0207 1174.8366 1178.6175 1192.4119 1203.9888 1223.2357 1238.1597 1249.9542 1265.5267 1271.3048 1299.5451 1325.8578 1343.0281 1347.6809 1365.9856 1379.5878 1407.8259 1429.9826 1432.1060 1434.7810 1444.3955 1457.2784 1467.5674 1468.3976 1469.6156 1474.3357 1478.8994 1480.3447 1492.4414 1559.2280 1580.9242 1595.7308 1611.6961 1614.1841 1658.1121 2142.2860 2839.4169 2859.4676 2869.6815 2961.2197 3007.0293 3013.2839 3035.1449 3050.4921 3096.1623 3123.5139 3129.6196 3133.2192 3133.6559 3146.2287 3161.0673 3168.5109 3173.3375 3186.9337 3421.7569
redmass: 4.6000 5.3979 4.7659 4.1576 4.2859 4.8823 4.0070 4.5011 3.9141 3.3214 4.5310 4.1150 5.1517 2.3463 1.4378 1.2196 5.8588 4.6457 3.0799 5.6206 2.9182 3.5704 4.2585 3.5315 2.7473 4.4187 2.8631 4.9651 4.9476 5.4848 6.3555 3.6145 4.5567 5.1350 5.4897 6.4188 6.2967 5.3627 1.2335 6.5006 1.2445 5.4765 1.8477 4.3526 4.8819 5.4856 2.5381 4.3572 2.5076 2.1432 1.3165 6.0906 1.4994 1.6613 1.5436 2.9292 4.2382 2.0369 1.9489 1.3892 5.2755 1.3615 2.6640 4.0700 3.0130 2.4796 1.7092 2.7070 1.2595 1.3711 2.4759 1.4726 1.0557 1.6429 1.6039 1.1988 2.4413 1.4433 1.9961 2.5341 1.7959 3.1654 1.5023 1.5395 1.5019 1.5461 4.2587 5.0464 1.5567 1.2208 2.1574 2.9273 1.0754 1.2555 1.0726 1.1245 1.6711 1.1479 1.0529 2.5393 5.8274 5.6529 6.8161 6.0387 6.9633 12.1709 6.0089 1.0705 1.0666 1.0608 1.0330 1.0870 1.0854 1.0739 1.1041 1.1002 1.0847 1.0896 1.0992 1.0886 1.0943 1.0997 1.0933 1.0913 1.0950 1.1599
irintensity: 0.9142 1.6765 1.0044 1.0707 0.0786 0.2987 0.9792 2.5030 2.6458 0.1052 0.3060 1.8160 1.4115 0.6640 1.2244 1.3466 2.9555 2.1888 0.5198 2.0214 2.1699 6.4523 4.1684 2.5226 2.7247 2.7136 0.1820 0.7277 0.3898 0.5924 11.8170 11.0452 7.5272 7.7588 2.5649 3.5065 0.7574 4.7099 70.7374 21.6285 68.3400 11.8699 45.0652 7.3242 6.6219 1.4138 42.7899 13.5358 35.2161 43.3256 15.9496 69.6555 10.2393 4.4156 2.0478 3.3828 1.8708 9.2785 8.3416 2.6409 0.6134 0.9419 59.6480 17.1022 6.9841 91.9818 11.0815 65.4996 0.0636 10.8226 14.9171 0.1836 0.2461 5.3994 33.7157 9.6871 38.4983 4.8033 5.2649 127.9563 25.7373 65.4586 31.6606 9.8508 12.7992 20.1244 9.6878 10.3734 32.3504 12.7515 5.5256 19.8841 9.3097 42.6679 10.2759 45.2894 14.8255 5.5841 11.8593 44.5313 59.8584 3.1684 16.1594 8.2459 48.7857 382.7056 0.2546 78.9795 46.4904 234.6166 79.4465 7.7163 14.3125 27.4648 45.6440 21.0813 1.1552 19.8484 12.9186 8.1856 32.5171 32.1377 14.1677 6.7788 7.4741 54.5186
temp: 298.150 k
press: 1.00000 atm
elementType: 8 8 8 7 6 6 6 6 6 6 6 6 6 6 6 6 6 6 6 6 6 6 6 6 6 1 1 1 1 1 1 1 1 1 1 1 1 1 1 1 1 1 1 1
symmnumber: 1
zpe: 899619.4 jmol-1
zpe.correction: 0.342647 hartree
zpe.thermalcorrener: 0.365809 hartree
zpe.thermalcorrenthalpy: 0.366753 hartree
zpe.thermalcorrgfe: 0.289046 hartree
zpe.sumelectzpe: -1090.190010 hartree
zpe.sumelectthermal: -1090.166848 hartree
zpe.sumelectthermalent: -1090.165904 hartree
zpe.sumelectthermalfe: -1090.243611 hartree
dipole: 2.8537 6.5365 -0.5474
dipole: 7.1532
quadrupole: -108.6229 -150.8492 -146.4468
quadrupole: 0.9811 1.6625 7.3930
quadrupole: 26.6834 -15.5429 -11.1405 0.9811 1.6625 7.3930
hfenergy: -1090.5326572 hartree
pointgroup: C01 [X(C21H19N1O3)]
dipole: 1.6932213 -2.2475484 0.0416665 debye
polarizability: 395.3503167|2.1981679|271.7669625|-0.6759402|14.648515|136.1471325 unknown
InChI: InChI=1S/C21H19NO3/c1-4-12-22(2)14-16-10-11-19(24-3)20-17(16)13-18(21(23)25-20)15-8-6-5-7-9-15/h1,5-11,13H,12,14H2,2-3H3
charge 0 multiplicity 1
44 atoms
O  0.930073 2.474511 0.147778
O  3.556343 2.990737 0.298693
O  -1.14241 3.417357 -0.030319
N  0.982338 -2.90407 -0.785256
C  2.183734 -1.048961 0.406054
C  1.273446 0.056851 0.287799
C  1.678436 -2.481489 0.46427
C  1.783358 1.381583 0.254154
C  -0.160976 -0.099452 0.215857
C  3.556992 -0.772358 0.490711
C  -1.046345 0.964468 0.095052
C  3.182833 1.650014 0.34018
C  4.063107 0.554352 0.459118
C  -0.513595 2.344645 0.062727
C  -2.516279 0.736604 -0.002423
C  0.247065 -4.187113 -0.612789
C  1.879137 -2.947064 -1.96008
C  -3.465705 1.705021 0.432882
C  -3.006598 -0.499545 -0.518106
C  -4.849601 1.434365 0.3722
C  -4.389082 -0.765097 -0.578305
C  -5.321288 0.200223 -0.129268
C  -0.867904 -4.077435 0.349217
C  4.989213 3.290225 0.380876
C  -1.80802 -3.993058 1.142414
H  2.540469 -3.156956 0.694356
H  0.951093 -2.598693 1.290721
H  -0.551996 -1.118602 0.255173
H  4.264052 -1.604923 0.58284
H  5.142277 0.717541 0.527001
H  -0.162044 -4.475189 -1.600203
H  0.921661 -5.022439 -0.290556
H  2.366971 -1.966288 -2.083235
H  1.290332 -3.155032 -2.870775
H  2.680923 -3.723186 -1.872972
H  -3.116686 2.669667 0.807446
H  -2.305716 -1.251127 -0.898297
H  -5.560547 2.19435 0.715271
H  -4.738876 -1.71967 -0.987448
H  -6.396827 -0.003338 -0.179649
H  5.541686 2.844051 -0.468864
H  5.419812 2.933385 1.336669
H  5.0501 4.386528 0.330684
H  -2.629659 -3.909792 1.830902
