program: Gaussian 09
title: 000175056
version: EM64L-G09RevD.01
frameworkgroup: C1[X(C15H14O2)]
method: RPBEPBE
basis: SDD
operation: Freq
keyword: #pfreq=noraman
keyword: PBEPBE/SDD
title: #p freq=noraman PBEPBE/SDD
converged: YES YES NO NO
title: Mulliken charges:
elementType: O O C C C C C C C C C C C C C C C H H H H H H H H H H H H H H
charge: -0.257727 -0.276207 -0.326705 -0.470074 -0.466659 0.314963 -0.494870 0.494573 0.367786 -0.603952 0.384197 -0.375390 -0.423714 -0.415421 -0.407902 -0.243292 -0.239482 0.270290 0.261118 0.248177 0.246956 0.260384 0.225206 0.240589 0.241082 0.274453 0.237138 0.238387 0.239253 0.228552 0.228292
chargesum: 0.00000
title: Mulliken charges with hydrogens summed into heavy atoms:
elementType: O O C C C C C C C C C C C C C C C
charge: -0.257727 -0.276207 -0.056415 0.039221 0.040681 0.314963 -0.029075 0.494573 0.367786 -0.362870 0.384197 -0.100937 -0.186576 -0.177034 -0.168649 -0.014740 -0.011190
polarizability: 2.55551456e+02 -1.81849421e+00 1.53936910e+02 -2.67545735e+01 -1.15951163e+01 1.09014870e+02
1716.lowfreq: 0.0003 0.0006 0.0007 3.8161 4.1544 10.8849 19.1850 36.8135 48.1396
frequency: 19.1004 36.8111 48.1160 76.9151 109.9815 154.0796 184.6568 194.8146 228.6826 274.4877 300.0885 324.6327 388.8418 403.2898 436.8099 471.7647 484.2492 514.0848 563.8781 621.2642 622.8771 660.3043 698.3782 729.2796 757.8437 761.2693 766.9395 788.3946 804.3420 807.3165 833.8705 845.7826 881.1028 881.9229 889.1352 919.0913 944.3383 948.9181 964.8163 989.2086 994.4286 1006.7824 1024.1382 1046.0138 1082.5785 1087.1234 1099.1131 1121.6852 1127.9000 1162.7573 1172.6728 1177.6538 1187.5521 1199.2955 1231.2632 1239.3580 1268.2296 1276.3430 1341.1683 1361.9436 1384.7769 1411.7859 1426.5525 1429.5693 1435.3418 1454.2796 1458.7683 1468.2003 1514.9376 1583.1266 1607.2594 1625.2701 1642.9914 3031.1199 3105.5800 3108.4934 3112.5809 3115.4692 3120.0516 3124.7344 3126.5287 3142.7008 3155.8058 3162.1217 3177.2666 3210.5230 3229.3705
redmass: 4.6455 4.5021 3.1848 6.1169 4.7792 5.1418 3.8639 4.7182 4.0338 3.5795 5.0225 3.3521 3.3340 2.9392 4.7254 3.5821 2.7969 6.3519 4.2805 6.1349 3.5627 3.5820 5.0592 3.0439 2.8073 1.9235 1.6227 2.6702 2.5277 1.6049 3.0675 1.4469 3.1507 1.9720 1.7047 1.7859 4.4726 3.5177 1.4091 1.3458 1.3726 2.0316 2.2047 1.2825 1.2288 1.5846 1.1716 2.4878 1.7740 1.3078 1.0893 1.3809 1.4459 2.1075 1.5652 1.5020 1.8321 1.8003 1.2752 1.6307 1.9066 5.3350 4.1445 1.0870 2.8244 1.3656 1.1196 2.6244 3.6544 7.2772 5.5862 8.9469 6.7772 1.0589 1.0503 1.1063 1.0615 1.0921 1.0857 1.0892 1.0881 1.0949 1.0969 1.1004 1.0925 1.1182 1.1156
irintensity: 0.0283 0.8565 1.4952 3.0085 0.4923 1.2197 1.2270 1.3493 4.1040 2.5852 3.1328 17.2363 0.6373 4.4995 2.7872 10.4377 18.0701 0.3608 4.5232 0.8212 3.5184 0.3209 3.8322 12.3160 10.2995 34.3534 12.1988 2.3747 7.0932 20.3226 155.4156 7.6387 19.5844 11.3172 6.4955 4.5346 5.6925 0.7776 7.6077 0.6375 0.3264 1.1100 6.6996 46.5488 18.2123 118.5400 1.1369 386.1551 51.3340 1.9734 0.0741 0.6138 15.8770 0.7191 8.1315 1.2769 5.3211 9.0993 35.9062 9.8465 135.2898 2.7662 0.5400 11.3231 0.8013 15.7089 20.0339 1.0656 11.1780 0.4175 5.3559 119.6357 0.0940 31.0938 15.0327 3.7745 9.8055 14.5215 5.7699 3.1904 4.1741 33.7516 5.9999 36.7204 1.6493 0.2193 12.1174
temp: 298.150 k
press: 1.00000 atm
elementType: 8 8 6 6 6 6 6 6 6 6 6 6 6 6 6 6 6 1 1 1 1 1 1 1 1 1 1 1 1 1 1
symmnumber: 1
zpe: 651395.9 jmol-1
zpe.correction: 0.248104 hartree
zpe.thermalcorrener: 0.262552 hartree
zpe.thermalcorrenthalpy: 0.263496 hartree
zpe.thermalcorrgfe: 0.204604 hartree
zpe.sumelectzpe: -729.226451 hartree
zpe.sumelectthermal: -729.212002 hartree
zpe.sumelectthermalent: -729.211058 hartree
zpe.sumelectthermalfe: -729.269950 hartree
dipole: -0.3485 -0.5906 1.3725
dipole: 1.5343
quadrupole: -85.9338 -90.7268 -101.1775
quadrupole: -2.2134 3.5989 0.0393
quadrupole: 6.6789 1.8859 -8.5648 -2.2134 3.5989 0.0393
hfenergy: -729.4745545 hartree
pointgroup: C01 [X(C15H14O2)]
dipole: 0.1642749 0.563603 0.1405189 debye
polarizability: 257.8109088|14.470472|135.4608461|13.1491478|-25.7959672|125.2314804 unknown
InChI: InChI=1S/C15H14O2/c16-15(13-7-8-13)17-10-11-5-6-12-3-1-2-4-14(12)9-11/h1-6,9,13H,7-8,10H2
charge 0 multiplicity 1
31 atoms
O  -2.179113 1.02037 -0.913284
O  -3.165399 -1.017891 -0.312148
C  -4.013144 1.090939 0.589584
C  -5.479837 0.6219 0.762354
C  -4.518869 0.508244 1.933604
C  -3.113401 0.236281 -0.227682
C  -1.194181 0.283561 -1.788163
C  0.080363 -0.038611 -1.042029
C  2.43469 0.467883 -0.492537
C  1.21727 0.763867 -1.188724
C  2.48008 -0.689702 0.378527
C  0.133969 -1.188206 -0.179285
C  1.303036 -1.499963 0.51227
C  3.609852 1.278578 -0.632795
C  3.697449 -0.989271 1.074366
C  4.781939 0.962752 0.058435
C  4.826206 -0.180872 0.919149
H  -3.814013 2.162414 0.532788
H  -5.753359 -0.300851 0.243964
H  -6.24587 1.401484 0.778116
H  -4.61191 1.208773 2.767546
H  -4.153529 -0.489042 2.191888
H  -1.017404 0.991386 -2.612991
H  -1.693226 -0.629806 -2.15661
H  1.18506 1.642722 -1.846014
H  -0.763594 -1.807258 -0.074632
H  1.338019 -2.378719 1.167322
H  3.574526 2.154283 -1.292224
H  3.729605 -1.86573 1.732743
H  5.673998 1.588524 -0.054678
H  5.751885 -0.417839 1.455139
