program: Gaussian 09
title: 000174863
version: EM64L-G09RevD.01
frameworkgroup: C1[X(C23H22O7)]
method: RPBEPBE
basis: SDD
operation: Freq
keyword: #pfreq=noraman
keyword: PBEPBE/SDD
title: #p freq=noraman PBEPBE/SDD
converged: YES YES NO NO
title: Mulliken charges:
elementType: O O O O O O O C C C C C C C C C C C C C C C C C C C C C C C H H H H H H H H H H H H H H H H H H H H H H
charge: -0.262430 -0.426479 -0.280751 -0.217230 -0.185663 -0.232062 -0.434706 -0.108983 -0.187832 -0.398164 -0.121508 0.183317 -0.581204 0.520391 0.248579 0.287962 -0.027287 0.086289 -0.542369 -0.474777 -0.841397 -0.679489 0.325001 -0.674561 0.461833 -0.320754 -0.403339 -0.385084 -0.341277 0.281072 0.270486 0.227258 0.268077 0.253771 0.210592 0.247776 0.282002 0.249036 0.280631 0.230217 0.309221 0.237131 0.335683 0.270031 0.255341 0.251605 0.237874 0.259855 0.230832 0.220584 0.250939 0.353962
chargesum: 0.00000
title: Mulliken charges with hydrogens summed into heavy atoms:
elementType: O O O O O O O C C C C C C C C C C C C C C C C C C C C C C C
charge: -0.262430 -0.090796 -0.280751 -0.217230 -0.185663 -0.232062 -0.080744 0.161503 0.039425 -0.130087 0.132263 0.183317 -0.122837 0.520391 0.248579 0.287962 -0.027287 0.086289 -0.260367 0.054890 -0.064828 -0.154117 0.325001 -0.185083 0.461833 -0.060899 -0.172507 -0.164500 -0.090338 0.281072
polarizability: 3.45510663e+02 -1.47782787e+01 2.65295657e+02 3.53757447e+01 -3.36959995e+00 2.17555019e+02
1716.lowfreq: -2.5715 -0.0006 0.0005 0.0007 3.4061 6.7934 9.4336 14.7094 20.2408
frequency: 8.2663 14.4824 20.1310 24.6667 37.1660 53.7492 59.5890 73.5053 87.6963 110.2168 129.9689 138.7856 145.8207 161.1960 173.2300 181.6996 203.2864 222.1283 232.1766 248.9570 265.2616 272.5773 280.7772 295.5176 307.4370 328.1783 337.1496 345.5427 358.1794 366.3060 378.9656 398.6624 400.4581 408.1822 411.4844 444.9627 453.1666 476.5495 510.6600 527.0143 531.8727 555.0528 568.4022 597.6165 615.1897 618.7549 634.3283 646.8657 658.7655 692.2808 697.1878 719.8354 730.1740 755.9419 775.0451 799.3483 803.5306 809.7818 822.2153 832.8366 851.4112 863.7512 882.9346 896.1037 903.2879 926.5576 932.2716 937.6389 946.2631 951.6134 956.5421 976.2156 986.6680 1005.1905 1007.3763 1012.0924 1026.6250 1039.1932 1050.2662 1055.8716 1083.1425 1084.9578 1108.0232 1115.6908 1122.7328 1146.1138 1163.7352 1169.0211 1174.5235 1182.0494 1190.7538 1202.9236 1208.6465 1212.6571 1214.9068 1233.9119 1243.3628 1248.5993 1252.7750 1277.5306 1289.7218 1296.3675 1306.4556 1316.9713 1325.4169 1327.8809 1351.3853 1354.5943 1357.3455 1371.7692 1389.1607 1393.8137 1407.2149 1427.7779 1446.6888 1448.0518 1450.5087 1470.4894 1483.5059 1504.6965 1591.5646 1599.8597 1627.2505 1630.7097 1648.9724 1666.0971 1671.6895 1698.8328 2916.1341 2952.2212 2961.5853 2982.4459 2987.8718 3003.5388 3011.0507 3028.5485 3050.7247 3060.9725 3074.9985 3086.6499 3101.9017 3115.9074 3119.0298 3127.4969 3158.5062 3171.1986 3186.4438 3222.8461 3536.1665 3581.7054
redmass: 7.0483 4.8279 6.6625 5.5726 6.5555 6.2558 5.3635 5.8343 5.3955 6.7013 6.0207 6.2936 3.8272 1.5329 2.2680 6.2417 4.3060 4.6379 4.5493 3.4985 4.4028 5.0510 2.8973 3.3509 2.5237 4.4003 1.7531 4.3348 3.9450 1.1160 4.9217 4.1970 3.5874 3.5230 2.9780 4.1746 4.9823 3.9694 3.1562 3.1531 3.6743 4.3990 4.6942 3.1595 5.2389 5.7320 6.6900 3.5956 3.3199 3.3723 4.0481 4.1567 3.8012 4.4942 3.7412 1.8722 3.9058 1.5588 2.1208 3.5018 2.4671 2.9123 3.2330 1.9724 6.1686 2.1383 2.2840 2.6142 3.1777 1.9834 1.5706 2.5842 2.0543 2.8225 1.8362 1.5411 3.5370 1.8124 4.6249 2.5341 2.9190 2.2812 1.5393 2.4886 2.7254 1.3577 1.7364 1.2572 1.4156 1.1248 1.5510 1.6502 1.6409 1.5118 1.3995 2.1473 2.5642 2.8757 2.4846 1.3541 1.3029 1.6482 1.3632 1.6456 2.1015 1.5532 1.3852 1.3678 1.4547 1.2881 1.1967 6.0819 1.1614 2.6726 1.0982 1.0783 1.1075 1.0871 1.0505 2.6965 8.4758 6.5206 6.3599 8.0274 10.2416 7.9718 7.0917 12.2629 1.0802 1.0664 1.0398 1.0816 1.0656 1.0869 1.0568 1.0949 1.0876 1.0925 1.1055 1.0947 1.0617 1.0897 1.0981 1.0898 1.0950 1.0954 1.0980 1.1158 1.0659 1.0660
irintensity: 0.2538 0.5443 0.2730 1.4359 1.6267 1.0414 0.2732 0.6694 8.7578 0.4931 2.2427 0.5895 1.9677 1.8447 4.4909 2.3257 6.1075 7.8910 3.7742 13.0590 2.8676 6.3059 7.0761 4.7111 20.6614 3.6692 81.7294 1.9500 5.5702 144.3770 1.1368 3.7402 9.6813 2.6205 0.5477 15.9129 15.9822 6.0142 19.7300 6.6075 18.5960 18.1172 18.3150 6.7896 2.2097 1.0077 0.3023 8.3295 10.0461 2.4626 2.9440 11.5810 0.0422 9.1902 19.4029 7.3113 55.7858 10.2447 16.9304 12.3962 19.3434 20.7147 18.5583 46.1823 57.1414 10.2926 31.6567 29.1319 110.4595 31.1856 18.5491 34.9180 11.4607 6.6568 59.7224 33.6395 99.0638 49.4649 43.5156 11.2795 14.5489 269.4041 284.5805 22.6126 25.1309 182.6077 21.9746 37.5975 11.2889 28.3655 51.3470 65.2219 8.4196 22.3274 27.1402 20.0142 39.4228 31.3991 24.2234 1.6700 26.0866 59.7673 11.3149 30.4961 7.2901 16.8915 10.3506 11.9364 14.3740 25.2577 57.3357 17.7788 33.6376 22.7399 39.1502 27.9843 27.1093 10.8697 15.4728 115.2377 244.7044 10.5445 43.8752 44.9889 145.4808 119.1275 34.2149 262.6413 13.0448 19.2163 25.0393 0.7590 14.4848 24.3616 18.1007 14.0372 13.2310 21.3507 16.8800 6.3728 2.1291 22.5612 5.4627 13.0084 4.3553 6.0510 3.6838 0.5652 10.0208 44.1052
temp: 298.150 k
press: 1.00000 atm
elementType: 8 8 8 8 8 8 8 6 6 6 6 6 6 6 6 6 6 6 6 6 6 6 6 6 6 6 6 6 6 6 1 1 1 1 1 1 1 1 1 1 1 1 1 1 1 1 1 1 1 1 1 1
symmnumber: 1
zpe: 1052088.4 jmol-1
zpe.correction: 0.400719 hartree
zpe.thermalcorrener: 0.428462 hartree
zpe.thermalcorrenthalpy: 0.429406 hartree
zpe.thermalcorrgfe: 0.338895 hartree
zpe.sumelectzpe: -1414.003122 hartree
zpe.sumelectthermal: -1413.975379 hartree
zpe.sumelectthermalent: -1413.974435 hartree
zpe.sumelectthermalfe: -1414.064945 hartree
dipole: 1.3306 1.3726 4.1579
dipole: 4.5763
quadrupole: -166.0212 -195.1413 -172.9603
quadrupole: 6.9375 15.9715 5.6321
quadrupole: 12.0198 -17.1004 5.0806 6.9375 15.9715 5.6321
hfenergy: -1414.4038408 hartree
pointgroup: C01 [X(C23H22O7)]
dipole: -0.5038005 0.4929375 -1.6567613 debye
polarizability: 344.4739987|15.9954888|265.5553465|36.593159|2.3783503|218.3319937 unknown
InChI: InChI=1S/C23H22O7/c1-11-7-16(25)20-12(2)23(28)30-22(20)21-14(9-17(26)19(11)21)10-29-18(27)8-13-3-5-15(24)6-4-13/h3-6,9,16,20-22,24-25H,2,7-8,10H2,1H3
charge 0 multiplicity 1
52 atoms
O  -1.314569 1.319543 1.247535
O  -4.565945 2.171965 -2.249942
O  1.012629 -0.663873 0.477115
O  -3.846019 -3.881123 0.902913
O  -0.963518 3.578901 1.729264
O  2.51998 0.274785 1.983678
O  8.451903 -0.595672 -0.855638
C  -2.393135 0.547493 0.540513
C  -2.827793 1.504548 -0.606487
C  -1.905745 -0.842576 0.075546
C  -4.172075 1.142873 -1.264431
C  -3.129608 -1.738641 -0.173943
C  -4.122651 -0.245007 -1.968903
C  -1.103932 -1.61972 1.124813
C  -4.142887 -1.475269 -1.061434
C  -2.67875 2.860949 0.070254
C  -3.029597 -2.919913 0.758075
C  -1.588854 2.715306 1.095125
C  -1.747205 -2.767681 1.491426
C  0.219598 -1.151428 1.64801
C  -5.349618 -2.3722 -1.234446
C  -3.333387 4.031204 -0.128971
C  2.152764 0.084329 0.805372
C  2.825384 0.620259 -0.454695
C  4.316215 0.303148 -0.529024
C  5.21847 0.790686 0.449486
C  4.829846 -0.481444 -1.592642
C  6.597742 0.506902 0.366504
C  6.206053 -0.773125 -1.689599
C  7.090067 -0.275568 -0.706455
H  -3.214143 0.419171 1.273327
H  -2.040065 1.432917 -1.392987
H  -1.279224 -0.710593 -0.829709
H  -4.99055 1.173295 -0.524115
H  -3.214676 -0.267575 -2.611017
H  -4.997097 -0.282036 -2.642868
H  -1.395492 -3.51554 2.205731
H  0.777609 -1.965192 2.142665
H  0.109196 -0.30952 2.355623
H  -6.27908 -1.788231 -1.079265
H  -5.3358 -3.228682 -0.545769
H  -5.394496 -2.746923 -2.276878
H  -3.897238 2.18533 -2.983211
H  -4.121588 4.118091 -0.882062
H  -3.074186 4.905269 0.480326
H  2.673435 1.718345 -0.437771
H  2.2957 0.225613 -1.336078
H  4.836706 1.379638 1.289745
H  4.147833 -0.872303 -2.35736
H  7.282956 0.891941 1.133181
H  6.607064 -1.377397 -2.508468
H  8.985776 -0.213569 -0.115563
