program: Gaussian 09
title: 000174849
version: EM64L-G09RevD.01
frameworkgroup: C1[X(C13H6Cl6O2S)]
method: RPBEPBE
basis: SDD
operation: Freq
keyword: #p
keyword: freq=noraman
keyword: PBEPBE/SDD
title: #p freq=noraman PBEPBE/SDD
converged: YES YES NO NO
title: Mulliken charges:
elementType: Cl Cl Cl Cl Cl Cl S O O C C C C C C C C C C C C C H H H H H H
charge: 0.047423 0.013387 0.032500 0.054156 0.024091 0.067182 0.915804 -0.516348 -0.545906 -0.019855 0.403881 -0.437041 0.540771 -0.155647 -0.360297 -0.074490 -0.387791 -0.376157 -0.727675 -0.052557 -0.108738 -0.104046 0.331570 0.295837 0.292871 0.278207 0.297797 0.271069
chargesum: 0.00000
title: Mulliken charges with hydrogens summed into heavy atoms:
elementType: Cl Cl Cl Cl Cl Cl S O O C C C C C C C C C C C C C
charge: 0.047423 0.013387 0.032500 0.054156 0.024091 0.067182 0.915804 -0.516348 -0.545906 -0.019855 0.403881 -0.105471 0.540771 -0.155647 -0.064461 -0.074490 -0.387791 -0.083286 0.119398 -0.052557 -0.108738 -0.104046
polarizability: 3.53904588e+02 -1.29601153e+01 2.52071345e+02 3.61787071e+00 7.69496043e+00 1.39100455e+02
1716.lowfreq: -6.0055 -1.9167 -0.0025 -0.0010 0.0025 1.9943 18.8260 31.3362 39.0944
frequency: 18.7489 31.3094 39.0891 58.7005 59.8354 74.7141 78.2818 116.4739 124.8727 141.4195 152.4152 164.5741 186.4022 193.5805 200.4997 210.5439 218.9716 230.3646 233.5807 244.3201 257.2411 269.9021 306.0947 316.7969 333.0466 338.3793 357.0463 377.9271 414.0961 466.1993 481.9489 511.9046 515.0674 534.8915 547.8936 581.9403 609.2765 623.5992 650.2973 710.5801 716.3296 731.0763 740.6566 783.3617 796.9370 867.8151 881.0388 894.8919 910.4975 949.4850 976.0940 995.4390 1014.5593 1026.2523 1107.4060 1133.0814 1178.9698 1194.6595 1267.7165 1302.3862 1303.6967 1344.2384 1351.8936 1382.0022 1395.1387 1408.4903 1421.1407 1446.3679 1520.7853 1542.1625 1572.4841 1592.0057 3031.9232 3123.8960 3173.0310 3180.4011 3180.5930 3190.1094
redmass: 16.3150 12.0361 15.8489 7.3514 12.7560 25.4224 18.4721 10.0123 2.9676 1.3939 6.9160 14.0868 8.1968 27.4525 21.5611 14.1259 14.6288 10.1877 6.1396 11.4490 6.6469 6.2552 9.4142 27.0107 10.4527 19.0239 8.7971 11.0750 8.8220 10.7144 8.6756 5.5946 5.7756 9.7049 6.2825 8.8271 11.8695 7.9295 8.3821 8.5174 4.3893 7.9672 6.1068 10.7017 12.8234 11.3941 1.4343 3.1430 1.4887 1.3554 1.5183 3.8960 1.9587 6.5753 6.8590 2.0145 1.9527 1.7692 3.7922 2.2826 1.4410 8.6918 5.1033 3.7710 3.5769 1.0559 1.0561 5.2409 9.0143 8.9863 8.1270 7.0625 1.0244 1.0915 1.0927 1.1070 1.0931 1.1082
irintensity: 0.6512 0.4376 1.6893 2.5081 1.8758 0.2211 0.6054 0.9008 3.4209 2.1603 1.2930 0.2756 0.1541 0.0694 0.2049 0.2656 0.4402 0.3943 0.2007 1.6250 0.1231 2.1666 3.4519 0.3566 18.6389 5.3067 6.7870 69.1468 12.6797 26.3742 8.8881 2.1554 2.4833 10.1102 2.6754 40.9944 22.7969 4.3642 3.0512 26.4033 10.1986 12.7684 3.2386 52.7781 48.0525 19.2589 24.6873 31.2311 5.3535 7.8774 21.3269 63.8144 42.2758 27.7910 26.9423 50.4091 36.0538 23.4132 36.5408 43.5830 12.2250 9.3154 45.0223 29.1709 193.2705 8.0419 15.6696 18.7923 33.7911 6.5035 1.0373 8.7858 0.3938 22.7700 0.7199 0.1202 0.2488 0.6578
temp: 298.150 k
press: 1.00000 atm
elementType: 17 17 17 17 17 17 16 8 8 6 6 6 6 6 6 6 6 6 6 6 6 6 1 1 1 1 1 1
symmnumber: 1
zpe: 404408.6 jmol-1
zpe.correction: 0.154031 hartree
zpe.thermalcorrener: 0.176882 hartree
zpe.thermalcorrenthalpy: 0.177827 hartree
zpe.thermalcorrgfe: 0.099036 hartree
zpe.sumelectzpe: -3806.093686 hartree
zpe.sumelectthermal: -3806.070835 hartree
zpe.sumelectthermalent: -3806.069891 hartree
zpe.sumelectthermalfe: -3806.148682 hartree
dipole: -0.1146 2.9723 2.3374
dipole: 3.7830
quadrupole: -181.5750 -191.8822 -171.5619
quadrupole: -8.4142 -17.8050 -3.9320
quadrupole: 0.0981 -10.2092 10.1111 -8.4142 -17.8050 -3.9320
hfenergy: -3806.2477173 hartree
pointgroup: C01 [X(C13H6Cl6O2S1)]
dipole: 0.0142426 -0.4277239 1.4254977 debye
polarizability: 352.3459041|-19.1073758|208.8526536|3.1384919|-56.0797715|183.8778298 unknown
InChI: InChI=1S/C13H6Cl6O2S/c1-22(20,21)9-3-5(2-7(14)11(9)17)6-4-8(15)12(18)13(19)10(6)16/h2-4H,1H3
charge 0 multiplicity 1
28 atoms
Cl 4.695063 -1.418536 0.288418
Cl 2.531907 -3.791317 0.853557
Cl -1.792057 -1.490277 2.52218
Cl -4.88838 -0.878475 2.058395
Cl -3.662324 1.642137 -2.765723
Cl -5.866441 0.698584 -0.567661
S  3.534974 1.709521 -0.551513
O  4.57945 1.295851 -1.727824
O  2.462908 2.925813 -0.777623
C  2.420278 0.193254 -0.077589
C  0.112148 -0.558151 0.134131
C  1.049039 0.473662 -0.127354
C  -1.348905 -0.271381 0.028598
C  2.922659 -1.084107 0.219132
C  0.599768 -1.855857 0.429727
C  1.983124 -2.111916 0.473336
C  -2.313483 -0.667091 0.994292
C  -1.806862 0.445024 -1.106566
C  4.52085 2.116179 1.035636
C  -3.687491 -0.373187 0.818947
C  -3.167536 0.74043 -1.284236
C  -4.126083 0.330988 -0.330522
H  0.739446 1.501179 -0.357248
H  -0.093505 -2.680037 0.613672
H  -1.090538 0.751309 -1.873599
H  5.161901 1.250042 1.245081
H  5.097906 3.014517 0.774813
H  3.781087 2.312241 1.823545
