program: Gaussian 09
title: 000174810
version: EM64L-G09RevD.01
frameworkgroup: C1[X(C11H14N4O4)]
method: RPBEPBE
basis: SDD
operation: Freq
keyword: #p
keyword: freq=noraman
keyword: PBEPBE/SDD
title: #p freq=noraman PBEPBE/SDD
converged: YES YES NO NO
title: Mulliken charges:
elementType: O O O O N N N N C C C C C C C C C C C H H H H H H H H H H H H H H
charge: -0.203559 -0.399889 -0.203790 -0.217534 -0.046080 -0.180351 -0.077995 0.042675 -0.261138 0.140121 -0.430382 -0.477502 -0.400705 -0.389433 0.065015 0.145848 0.310958 -0.364830 -0.645279 0.310289 0.252350 0.212815 0.251490 0.233054 0.205068 0.217623 0.214362 0.218917 0.357355 0.293802 0.303356 0.261270 0.262099
chargesum: 0.00000
title: Mulliken charges with hydrogens summed into heavy atoms:
elementType: O O O O N N N N C C C C C C C C C C C
charge: -0.203559 -0.042533 -0.203790 -0.217534 -0.046080 -0.180351 -0.077995 0.042675 0.049151 0.140121 0.034784 0.007042 0.021985 0.043846 0.065015 0.145848 0.310958 -0.071028 0.181447
polarizability: 2.83957449e+02 -1.19214066e+01 1.50685236e+02 2.52655113e+00 1.39509899e+01 1.08329944e+02
1716.lowfreq: -19.0320 -5.2887 -0.0006 -0.0005 0.0007 5.7918 31.3885 42.0227 59.7327
frequency: 31.0331 41.8882 59.7069 81.0828 89.3637 124.0622 147.6038 153.1624 185.8594 232.3044 242.6171 256.4920 257.7346 312.7645 332.6895 346.4123 356.0735 374.6561 391.6280 435.3932 455.9321 472.3560 485.2118 564.6580 580.1751 583.3862 597.4937 608.2446 670.7314 688.7032 697.5581 727.1410 749.4815 762.4607 826.7812 846.8725 861.1000 880.4062 895.8356 908.2506 923.4605 942.2787 956.4242 1025.0504 1054.3887 1067.2906 1086.8448 1107.3235 1110.0924 1121.7600 1126.9014 1143.3224 1155.5126 1193.8599 1205.2875 1213.3865 1243.2153 1256.1742 1273.8059 1294.0969 1301.3300 1320.0670 1322.7131 1338.0807 1340.9162 1341.3047 1346.1283 1375.0119 1379.0098 1425.5292 1452.3058 1462.1502 1464.8387 1467.8685 1474.4792 1481.2253 1482.2750 1484.2519 1544.2922 2978.4176 2990.1506 2991.0235 3010.2947 3019.1726 3046.0446 3053.3960 3061.8054 3073.2472 3078.3536 3122.0846 3135.2552 3254.5880 3541.4608
redmass: 6.2972 5.6924 5.1710 3.9854 6.4474 2.9710 3.6069 1.0850 7.4100 5.0254 4.8244 3.2702 4.4429 1.7120 3.4175 4.7396 1.4935 5.3594 4.4979 4.1968 4.9142 8.0693 3.1308 3.1395 4.8250 5.6500 4.6759 5.5600 6.2952 7.5931 6.0125 10.2987 9.4752 2.5700 2.1754 2.5803 3.3808 1.3972 4.0187 3.2889 1.9525 2.5772 2.5313 3.0849 2.1190 1.9076 1.8657 2.3416 3.1677 1.5014 1.3138 1.6899 1.9013 1.7868 2.9172 2.1472 2.1256 1.4506 1.4771 1.3399 4.2625 5.6462 1.5023 1.3642 2.8249 2.2475 1.5111 2.2090 4.1750 2.7273 1.0827 3.1325 1.1131 1.1022 2.0392 1.0459 1.0958 1.1885 8.3765 1.0643 1.0628 1.0625 1.0624 1.0326 1.0975 1.0997 1.0936 1.1012 1.0931 1.1017 1.1054 1.0995 1.0656
irintensity: 0.6466 1.3604 2.5293 1.6397 2.9310 1.2891 1.1126 0.3801 2.6294 6.5904 0.7482 7.6373 12.7493 8.6009 9.4753 9.9616 65.5269 4.7446 15.1185 7.5913 2.6549 14.0545 11.8604 28.0639 8.2249 0.2579 8.3112 41.8704 33.3264 10.1555 45.6517 3.4448 13.8269 26.5105 75.0946 9.4687 22.4625 23.5432 5.5527 41.7781 12.2010 21.8535 17.2894 86.7853 24.9041 42.1022 3.2993 21.5721 25.4156 20.2969 0.2249 9.1709 73.9869 54.9735 188.3753 12.5103 85.6706 32.9600 98.6879 8.4666 171.6135 7.2475 28.2263 2.0246 77.5381 62.7919 22.2812 25.1313 51.0713 15.8642 10.8217 94.7742 4.7104 20.3081 11.3088 17.9955 9.1631 24.3245 23.4479 29.3728 24.4582 22.2469 13.2856 13.3537 45.9729 47.8585 9.0102 13.4236 14.9624 6.8121 3.7381 2.7727 13.8382
temp: 298.150 k
press: 1.00000 atm
elementType: 8 8 8 8 7 7 7 7 6 6 6 6 6 6 6 6 6 6 6 1 1 1 1 1 1 1 1 1 1 1 1 1 1
symmnumber: 1
zpe: 663777.0 jmol-1
zpe.correction: 0.252819 hartree
zpe.thermalcorrener: 0.269892 hartree
zpe.thermalcorrenthalpy: 0.270836 hartree
zpe.thermalcorrgfe: 0.207416 hartree
zpe.sumelectzpe: -945.918793 hartree
zpe.sumelectthermal: -945.901721 hartree
zpe.sumelectthermalent: -945.900776 hartree
zpe.sumelectthermalfe: -945.964196 hartree
dipole: 3.8103 1.1893 -0.2464
dipole: 3.9992
quadrupole: -136.9094 -113.3231 -109.3069
quadrupole: 10.5820 -4.1432 -2.7510
quadrupole: -17.0630 6.5233 10.5396 10.5820 -4.1432 -2.7510
hfenergy: -946.1716127 hartree
pointgroup: C01 [X(C11H14N4O4)]
dipole: -1.509499 0.4437867 0.0106803 debye
polarizability: 282.8975787|15.135709|150.07698|10.2875675|-14.7640472|109.9980708 unknown
InChI: InChI=1S/C11H14N4O4/c1-14-8(15(17)18)6-12-10(14)9-7-4-2-3-5-11(7,16)19-13-9/h6-7,16H,2-5H2,1H3
charge 0 multiplicity 1
33 atoms
O  -2.342355 -1.763028 0.224583
O  -2.873233 -1.307506 -2.091205
O  5.1678 1.18388 -0.201261
O  4.747113 -0.854734 0.764992
N  -0.910225 -1.589228 0.349957
N  1.948072 -0.486772 0.199325
N  1.016021 1.330702 -0.844707
N  4.364908 0.234693 0.165326
C  -1.784134 0.40828 -0.639718
C  -2.858032 -0.701374 -0.780072
C  -2.107427 1.48381 0.450577
C  -4.31093 -0.385502 -0.436905
C  -3.599025 1.877821 0.461422
C  -4.472936 0.629224 0.71276
C  -0.582756 -0.410223 -0.185232
C  0.77037 0.105697 -0.260589
C  2.973071 0.42169 -0.118307
C  2.373028 1.525427 -0.755883
C  2.077239 -1.79761 0.880035
H  -1.614747 0.905804 -1.608036
H  -1.453954 2.355124 0.270249
H  -1.84781 1.081241 1.449668
H  -4.818191 -1.34068 -0.211933
H  -4.771649 0.013939 -1.359226
H  -3.883062 2.348168 -0.501773
H  -3.76768 2.632713 1.252215
H  -4.179941 0.165059 1.674815
H  -5.539473 0.907225 0.798288
H  -1.960681 -1.60348 -2.345769
H  2.869723 2.413903 -1.135239
H  1.074243 -2.238961 0.962164
H  2.743446 -2.455896 0.301795
H  2.519907 -1.659105 1.878285
